{"text_format":"1","workbook":"xlsx","n_sheets":16,"sheets":["Accueil","liste",".descripteurs",".langue","descripteurs","activites","evaluation",".calc_eva",".init","commentaires","Ecrire","Comprendre","Parler","Lire","Dialoguer","synthese classe"],"not_rendered":{"charts":0,"images":1,"macros":1,"external_links":0,"defined_names":15,"comments":2,"pivot_tables":0},"unopened":[],"bounds":{"document_bytes":16777216,"sheet_cells":100000,"rows_first":2000,"rows_last":500,"rows_between":2000,"halvings":0,"cell_chars":16384,"cell_head_chars":4096},"cells_cut":0,"cells_raw":0,"read":"whole","date_system":"1900"}

{"sheet":"Accueil","index":0,"n_rows":30,"n_cols":1,"rows_kept":30,"cut":false,"hidden":false,"merged":[]}
[]
["EVALUER LE NIVEAU A1"]
["EN LANGUE ETRANGERE"]
[]
["Le cadre de référence"]
["Dans le but d’aider à l’évaluation des connaissances et capacités dans la perspective de la validation des compétences du socle commun, certaines formulations du livret doivent être clarifiées. Ce document, qui concerne la  COMPETENCE 2 du socle commun, à savoir « La maîtrise d’une langue vivante étrangère », est destiné à clarifier le cadre et les procédures d’évaluation des élèves au cours de leur scolarité."]
["Cette compétence regroupe cinq domaines d’activités langagières faisant chacun l’objet d’une fiche : "]
["-          Réagir et dialoguer, "]
{"$rows_left_out":23}
{"sheet":"liste","index":1,"n_rows":31,"n_cols":3,"rows_kept":31,"cut":false,"hidden":false,"merged":[]}
["NOM et Prénom","langue étudiée","ID"]
["PICASSO Pablo","Espagnol",1]
["FREUD Sigmund","Allemand",2]
["HOLMES Sherlock","Anglais",3]
["CHAHINE Youcef","Arabe",4]
["NOM5","Espagnol",5]
["NOM6","Espagnol",6]
["NOM7","Espagnol",7]
{"$rows_left_out":24}
{"sheet":".descripteurs","index":2,"n_rows":263,"n_cols":3,"rows_kept":263,"cut":false,"hidden":true,"merged":[]}
["Domaine","Item","Descripteur"]
["Ecrire","Copier des mots isolés et des textes courts","Copier des textes courts imprimés (des listes : cadeaux, ingrédients, de courses, de menu, de lunch box, de sandwich... un court poème par exemple) "]
["Ecrire","Copier des mots isolés et des textes courts","Recopier des mots à partir d'un modèle (livre, affiche, tableau...)"]
["Ecrire","Copier des mots isolés et des textes courts","Compléter des grilles de mots (fléchés, codés, cachés, croisés...)"]
["Ecrire","Copier des mots isolés et des textes courts","Compléter des phrases à trous à partir d'une liste de mots en désordre"]
["Ecrire","Copier des mots isolés et des textes courts","Compléter des phrases qui permettent de se décrire à l'aide d'une liste de mots en désordre"]
["Ecrire","Copier des mots isolés et des textes courts","Copier des phrases à remettre dans l'ordre d'une histoire"]
["Ecrire","Copier des mots isolés et des textes courts","Compléter une chanson connue avec une liste de mots manquants "]
{"$rows_left_out":256}
{"sheet":".langue","index":3,"n_rows":4,"n_cols":1,"rows_kept":4,"cut":false,"hidden":true,"merged":[]}
["Anglais"]
["Allemand"]
["Espagnol"]
["Arabe"]

{"sheet":"descripteurs","index":4,"n_rows":35,"n_cols":3,"rows_kept":35,"cut":false,"hidden":true,"merged":[]}
["Domaine","Item","Descripteur"]
["Ecrire","Copier des mots isolés et des textes courts"]
["Ecrire","Copier des mots isolés et des textes courts"]
["Ecrire","Ecrire un message électronique simple ou une courte carte postale en référence à des modèles "]
["Ecrire","Ecrire un message électronique simple ou une courte carte postale en référence à des modèles "]
["Ecrire","Renseigner un questionnaire"]
["Ecrire","Renseigner un questionnaire"]
["Ecrire","Produire de manière autonome quelques phrases"]
{"$rows_left_out":28}
{"sheet":"activites","index":5,"n_rows":349,"n_cols":4,"rows_kept":349,"cut":false,"hidden":false,"merged":[]}
["Domaine","Item","Descripteur","Tâches communicatives"]
[{"$f":"IF('.descripteurs'!$A2='.descripteurs'!A1,\"\",'.descripteurs'!$A2)","v":"Ecrire"},{"$f":"IF('.descripteurs'!$B2='.descripteurs'!B1,\"\",'.descripteurs'!$B2)","v":"Copier des mots isolés et des textes courts"},{"$f":"'.descripteurs'!$C2","v":"Copier des textes courts imprimés (des listes : cadeaux, ingrédients, de courses, de menu, de lunch box, de sandwich... un court poème par exemple) "},"E1-1 : Préparation d’un événement festif à l’école : liste d’ingrédients, liste de courses,  ou  saynète : commande au père Noel, fabrication d’un livre sur les sentiments, les petits riens …"]
[{"$f":"IF('.descripteurs'!$A3='.descripteurs'!A2,\"\",'.descripteurs'!$A3)","v":""},{"$f":"IF('.descripteurs'!$B3='.descripteurs'!B2,\"\",'.descripteurs'!$B3)","v":""},{"$f":"'.descripteurs'!$C3","v":"Recopier des mots à partir d'un modèle (livre, affiche, tableau...)"},"E1-2 : Elaboration d’une exposition, d’un carnet de lectures (compilation  de morceaux choisis), d’un diaporama, d’une carte mentale."]
[{"$f":"IF('.descripteurs'!$A4='.descripteurs'!A3,\"\",'.descripteurs'!$A4)","v":""},{"$f":"IF('.descripteurs'!$B4='.descripteurs'!B3,\"\",'.descripteurs'!$B4)","v":""},{"$f":"'.descripteurs'!$C4","v":"Compléter des grilles de mots (fléchés, codés, cachés, croisés...)"},"E1-3 : Fabriquer des grilles et se les envoyer entre classes ou correspondants."]
[{"$f":"IF('.descripteurs'!$A5='.descripteurs'!A4,\"\",'.descripteurs'!$A5)","v":""},{"$f":"IF('.descripteurs'!$B5='.descripteurs'!B4,\"\",'.descripteurs'!$B5)","v":""},{"$f":"'.descripteurs'!$C5","v":"Compléter des phrases à trous à partir d'une liste de mots en désordre"},"E1-4 : représente une tâche intermédiaire, pour acquérir le lexique qui permettra de réaliser E1-1 par exemple."]
[{"$f":"IF('.descripteurs'!$A6='.descripteurs'!A5,\"\",'.descripteurs'!$A6)","v":""},{"$f":"IF('.descripteurs'!$B6='.descripteurs'!B5,\"\",'.descripteurs'!$B6)","v":""},{"$f":"'.descripteurs'!$C6","v":"Compléter des phrases qui permettent de se décrire à l'aide d'une liste de mots en désordre"},"E1-5 : Dans le cadre d’une lettre aux correspondants,  d’une exposition , pour se présenter (préférable à l’envoi d’une photo)."]
[{"$f":"IF('.descripteurs'!$A7='.descripteurs'!A6,\"\",'.descripteurs'!$A7)","v":""},{"$f":"IF('.descripteurs'!$B7='.descripteurs'!B6,\"\",'.descripteurs'!$B7)","v":""},{"$f":"'.descripteurs'!$C7","v":"Copier des phrases à remettre dans l'ordre d'une histoire"},"E1- 6 : pour préparer le détournement d’un album avec didapage."]
[{"$f":"IF('.descripteurs'!$A8='.descripteurs'!A7,\"\",'.descripteurs'!$A8)","v":""},{"$f":"IF('.descripteurs'!$B8='.descripteurs'!B7,\"\",'.descripteurs'!$B8)","v":""},{"$f":"'.descripteurs'!$C8","v":"Compléter une chanson connue avec une liste de mots manquants "},"E1-7 : quizz interclasses ou inter-écoles sur la culture anglophone ou  saynète (jeu télévisé)"]
{"$rows_left_out":342}
{"sheet":"evaluation","index":6,"n_rows":349,"n_cols":34,"rows_kept":349,"cut":false,"hidden":false,"merged":[]}
["Domaine","Item","Descripteur","Validation collective",{"$f":"INDIRECT(\"liste!\"&ADDRESS(COLUMN(liste!A2)+1,ROW(liste!A2)-1))","v":"PICASSO Pablo"},{"$f":"INDIRECT(\"liste!\"&ADDRESS(COLUMN(liste!B2)+1,ROW(liste!B2)-1))","v":"FREUD Sigmund"},{"$f":"INDIRECT(\"liste!\"&ADDRESS(COLUMN(liste!C2)+1,ROW(liste!C2)-1))","v":"HOLMES Sherlock"},{"$f":"INDIRECT(\"liste!\"&ADDRESS(COLUMN(liste!D2)+1,ROW(liste!D2)-1))","v":"CHAHINE Youcef"},{"$f":"INDIRECT(\"liste!\"&ADDRESS(COLUMN(liste!E2)+1,ROW(liste!E2)-1))","v":"NOM5"},{"$f":"INDIRECT(\"liste!\"&ADDRESS(COLUMN(liste!F2)+1,ROW(liste!F2)-1))","v":"NOM6"},{"$f":"INDIRECT(\"liste!\"&ADDRESS(COLUMN(liste!G2)+1,ROW(liste!G2)-1))","v":"NOM7"},{"$f":"INDIRECT(\"liste!\"&ADDRESS(COLUMN(liste!H2)+1,ROW(liste!H2)-1))","v":"NOM8"},{"$f":"INDIRECT(\"liste!\"&ADDRESS(COLUMN(liste!I2)+1,ROW(liste!I2)-1))","v":"NOM9"},{"$f":"INDIRECT(\"liste!\"&ADDRESS(COLUMN(liste!J2)+1,ROW(liste!J2)-1))","v":"NOM10"},{"$f":"INDIRECT(\"liste!\"&ADDRESS(COLUMN(liste!K2)+1,ROW(liste!K2)-1))","v":"NOM11"},{"$f":"INDIRECT(\"liste!\"&ADDRESS(COLUMN(liste!L2)+1,ROW(liste!L2)-1))","v":"NOM12"},{"$f":"INDIRECT(\"liste!\"&ADDRESS(COLUMN(liste!M2)+1,ROW(liste!M2)-1))","v":"NOM13"},{"$f":"INDIRECT(\"liste!\"&ADDRESS(COLUMN(liste!N2)+1,ROW(liste!N2)-1))","v":"NOM14"},{"$f":"INDIRECT(\"liste!\"&ADDRESS(COLUMN(liste!O2)+1,ROW(liste!O2)-1))","v":"NOM15"},{"$f":"INDIRECT(\"liste!\"&ADDRESS(COLUMN(liste!P2)+1,ROW(liste!P2)-1))","v":"NOM16"},{"$f":"INDIRECT(\"liste!\"&ADDRESS(COLUMN(liste!Q2)+1,ROW(liste!Q2)-1))","v":"NOM17"},{"$f":"INDIRECT(\"liste!\"&ADDRESS(COLUMN(liste!R2)+1,ROW(liste!R2)-1))","v":"NOM18"},{"$f":"INDIRECT(\"liste!\"&ADDRESS(COLUMN(liste!S2)+1,ROW(liste!S2)-1))","v":"NOM19"},{"$f":"INDIRECT(\"liste!\"&ADDRESS(COLUMN(liste!T2)+1,ROW(liste!T2)-1))","v":"NOM20"},{"$f":"INDIRECT(\"liste!\"&ADDRESS(COLUMN(liste!U2)+1,ROW(liste!U2)-1))","v":"NOM21"},{"$f":"INDIRECT(\"liste!\"&ADDRESS(COLUMN(liste!V2)+1,ROW(liste!V2)-1))","v":"NOM22"},{"$f":"INDIRECT(\"liste!\"&ADDRESS(COLUMN(liste!W2)+1,ROW(liste!W2)-1))","v":"NOM23"},{"$f":"INDIRECT(\"liste!\"&ADDRESS(COLUMN(liste!X2)+1,ROW(liste!X2)-1))","v":"NOM24"},{"$f":"INDIRECT(\"liste!\"&ADDRESS(COLUMN(liste!Y2)+1,ROW(liste!Y2)-1))","v":"NOM25"},{"$f":"INDIRECT(\"liste!\"&ADDRESS(COLUMN(liste!Z2)+1,ROW(liste!Z2)-1))","v":"NOM26"},{"$f":"INDIRECT(\"liste!\"&ADDRESS(COLUMN(liste!AA2)+1,ROW(liste!AA2)-1))","v":"NOM27"},{"$f":"INDIRECT(\"liste!\"&ADDRESS(COLUMN(liste!AB2)+1,ROW(liste!AB2)-1))","v":"NOM28"},{"$f":"INDIRECT(\"liste!\"&ADDRESS(COLUMN(liste!AC2)+1,ROW(liste!AC2)-1))","v":"NOM29"},{"$f":"INDIRECT(\"liste!\"&ADDRESS(COLUMN(liste!AD2)+1,ROW(liste!AD2)-1))","v":"NOM30"}]
[{"$f":"IF('.descripteurs'!$A2='.descripteurs'!A1,\"\",'.descripteurs'!$A2)","v":"Ecrire"},{"$f":"IF('.descripteurs'!$B2='.descripteurs'!B1,\"\",'.descripteurs'!$B2)","v":"Copier des mots isolés et des textes courts"},{"$f":"'.descripteurs'!$C2","v":"Copier des textes courts imprimés (des listes : cadeaux, ingrédients, de courses, de menu, de lunch box, de sandwich... un court poème par exemple) "},null,{"$f":"IF($D2=0,\"\",$D2)","v":""},{"$f":"IF($D2=0,\"\",$D2)","v":""},"","","","","","","","","","","","","","","","","","","","","","","","","","","",""]
[{"$f":"IF('.descripteurs'!$A3='.descripteurs'!A2,\"\",'.descripteurs'!$A3)","v":""},{"$f":"IF('.descripteurs'!$B3='.descripteurs'!B2,\"\",'.descripteurs'!$B3)","v":""},{"$f":"'.descripteurs'!$C3","v":"Recopier des mots à partir d'un modèle (livre, affiche, tableau...)"},null,{"$f":"IF($D3=0,\"\",$D3)","v":""},"","","","","","","","","","","","","","","","","","","","","","","","","","","","",""]
[{"$f":"IF('.descripteurs'!$A4='.descripteurs'!A3,\"\",'.descripteurs'!$A4)","v":""},{"$f":"IF('.descripteurs'!$B4='.descripteurs'!B3,\"\",'.descripteurs'!$B4)","v":""},{"$f":"'.descripteurs'!$C4","v":"Compléter des grilles de mots (fléchés, codés, cachés, croisés...)"},null,{"$f":"IF($D4=0,\"\",$D4)","v":""},"","","","","","","","","","","","","","","","","","","","","","","","","","","","",""]
[{"$f":"IF('.descripteurs'!$A5='.descripteurs'!A4,\"\",'.descripteurs'!$A5)","v":""},{"$f":"IF('.descripteurs'!$B5='.descripteurs'!B4,\"\",'.descripteurs'!$B5)","v":""},{"$f":"'.descripteurs'!$C5","v":"Compléter des phrases à trous à partir d'une liste de mots en désordre"},null,{"$f":"IF($D5=0,\"\",$D5)","v":""},"","","","","","","","","","","","","","","","","","","","","","","","","","","","",""]
[{"$f":"IF('.descripteurs'!$A6='.descripteurs'!A5,\"\",'.descripteurs'!$A6)","v":""},{"$f":"IF('.descripteurs'!$B6='.descripteurs'!B5,\"\",'.descripteurs'!$B6)","v":""},{"$f":"'.descripteurs'!$C6","v":"Compléter des phrases qui permettent de se décrire à l'aide d'une liste de mots en désordre"},null,{"$f":"IF($D6=0,\"\",$D6)","v":""},"","","","","","","","","","","","","","","","","","","","","","","","","","","","",""]
[{"$f":"IF('.descripteurs'!$A7='.descripteurs'!A6,\"\",'.descripteurs'!$A7)","v":""},{"$f":"IF('.descripteurs'!$B7='.descripteurs'!B6,\"\",'.descripteurs'!$B7)","v":""},{"$f":"'.descripteurs'!$C7","v":"Copier des phrases à remettre dans l'ordre d'une histoire"},null,"","","","","","","","","","","","","","","","","","","","","","","","","","","","","",""]
[{"$f":"IF('.descripteurs'!$A8='.descripteurs'!A7,\"\",'.descripteurs'!$A8)","v":""},{"$f":"IF('.descripteurs'!$B8='.descripteurs'!B7,\"\",'.descripteurs'!$B8)","v":""},{"$f":"'.descripteurs'!$C8","v":"Compléter une chanson connue avec une liste de mots manquants "},null,"","","","","","","","","","","","","","","","","","","","","","","","","","","","","",""]
{"$rows_left_out":342}
{"sheet":".calc_eva","index":7,"n_rows":263,"n_cols":5,"rows_kept":263,"cut":false,"hidden":true,"merged":[]}
[{"$f":"evaluation!A1","v":"Domaine"},{"$f":"evaluation!B1","v":"Item"},{"$f":"evaluation!C1","v":"Descripteur"},null,{"$f":"qui","v":"PICASSO Pablo"}]
[{"$f":"evaluation!A2","v":"Ecrire"},{"$f":"evaluation!B2","v":"Copier des mots isolés et des textes courts"},{"$f":"evaluation!C2","v":"Copier des textes courts imprimés (des listes : cadeaux, ingrédients, de courses, de menu, de lunch box, de sandwich... un court poème par exemple) "},{"$f":"IF($E2>0,C2,\"\")","v":"Copier des textes courts imprimés (des listes : cadeaux, ingrédients, de courses, de menu, de lunch box, de sandwich... un court poème par exemple) "},{"$f":"INDIRECT(\"evaluation!\"&ADDRESS(ROW(),4+VLOOKUP(qui,liste!$A$2:$C$31,3,FALSE)))","v":""}]
[{"$f":"evaluation!A3","v":""},{"$f":"evaluation!B3","v":""},{"$f":"evaluation!C3","v":"Recopier des mots à partir d'un modèle (livre, affiche, tableau...)"},"Recopier des mots à partir d'un modèle (livre, affiche, tableau...)",{"$f":"INDIRECT(\"evaluation!\"&ADDRESS(ROW(),4+VLOOKUP(qui,liste!$A$2:$C$31,3,FALSE)))","v":""}]
[{"$f":"evaluation!A4","v":""},{"$f":"evaluation!B4","v":""},{"$f":"evaluation!C4","v":"Compléter des grilles de mots (fléchés, codés, cachés, croisés...)"},"Compléter des grilles de mots (fléchés, codés, cachés, croisés...)",{"$f":"INDIRECT(\"evaluation!\"&ADDRESS(ROW(),4+VLOOKUP(qui,liste!$A$2:$C$31,3,FALSE)))","v":""}]
[{"$f":"evaluation!A5","v":""},{"$f":"evaluation!B5","v":""},{"$f":"evaluation!C5","v":"Compléter des phrases à trous à partir d'une liste de mots en désordre"},"Compléter des phrases à trous à partir d'une liste de mots en désordre",{"$f":"INDIRECT(\"evaluation!\"&ADDRESS(ROW(),4+VLOOKUP(qui,liste!$A$2:$C$31,3,FALSE)))","v":""}]
[{"$f":"evaluation!A6","v":""},{"$f":"evaluation!B6","v":""},{"$f":"evaluation!C6","v":"Compléter des phrases qui permettent de se décrire à l'aide d'une liste de mots en désordre"},"Compléter des phrases qui permettent de se décrire à l'aide d'une liste de mots en désordre",{"$f":"INDIRECT(\"evaluation!\"&ADDRESS(ROW(),4+VLOOKUP(qui,liste!$A$2:$C$31,3,FALSE)))","v":""}]
[{"$f":"evaluation!A7","v":""},{"$f":"evaluation!B7","v":""},{"$f":"evaluation!C7","v":"Copier des phrases à remettre dans l'ordre d'une histoire"},"Copier des phrases à remettre dans l'ordre d'une histoire",{"$f":"INDIRECT(\"evaluation!\"&ADDRESS(ROW(),4+VLOOKUP(qui,liste!$A$2:$C$31,3,FALSE)))","v":""}]
[{"$f":"evaluation!A8","v":""},{"$f":"evaluation!B8","v":""},{"$f":"evaluation!C8","v":"Compléter une chanson connue avec une liste de mots manquants "},"Compléter une chanson connue avec une liste de mots manquants ",{"$f":"INDIRECT(\"evaluation!\"&ADDRESS(ROW(),4+VLOOKUP(qui,liste!$A$2:$C$31,3,FALSE)))","v":""}]
{"$rows_left_out":256}
{"sheet":".init","index":8,"n_rows":263,"n_cols":34,"rows_kept":263,"cut":false,"hidden":true,"merged":[]}
[]
[null,null,null,null,{"$f":"IF($D2=0,\"\",$D2)","v":""},{"$f":"IF($D2=0,\"\",$D2)","v":""},"","","","","","","","","","","","","","","","","","","","","","","","","","","",""]
[null,null,null,null,{"$f":"IF($D3=0,\"\",$D3)","v":""},"","","","","","","","","","","","","","","","","","","","","","","","","","","","",""]
[null,null,null,null,{"$f":"IF($D4=0,\"\",$D4)","v":""},"","","","","","","","","","","","","","","","","","","","","","","","","","","","",""]
[null,null,null,null,{"$f":"IF($D5=0,\"\",$D5)","v":""},"","","","","","","","","","","","","","","","","","","","","","","","","","","","",""]
[null,null,null,null,{"$f":"IF($D6=0,\"\",$D6)","v":""},"","","","","","","","","","","","","","","","","","","","","","","","","","","","",""]
[null,null,null,null,"","","","","","","","","","","","","","","","","","","","","","","","","","","","","",""]
[null,null,null,null,"","","","","","","","","","","","","","","","","","","","","","","","","","","","","",""]
{"$rows_left_out":256}
{"sheet":"commentaires","index":9,"n_rows":31,"n_cols":17,"rows_kept":31,"cut":false,"hidden":false,"merged":[]}
["NOM et Prénom","Commentaire_Ecrire","Validation_Ecrire","Commentaire_Comprendre à l'oral","Validation_Comprendre à l'oral","Commentaire_Parler en continu","Validation_Parler en continu","Commentaire_Lire","Validation_Lire","Commentaire_Réagir et dialoguer","Validation_Réagir et dialoguer","VALIDATION_PALIER_A1","val_ec","val_co","val_pa","val_li","val_re"]
[{"$f":"liste!A2","v":"PICASSO Pablo"},null,1,null,1,null,1,null,1,null,1,1,{"$f":"IF($L2=0,C2,0)","v":0},{"$f":"IF($L2=0,E2,0)","v":0},{"$f":"IF($L2=0,G2,0)","v":0},{"$f":"IF($L2=0,I2,0)","v":0},{"$f":"IF($L2=0,K2,0)","v":0}]
[{"$f":"liste!A3","v":"FREUD Sigmund"},null,1,null,1,null,1,null,0,null,0,1,{"$f":"IF($L3=0,C3,0)","v":0},{"$f":"IF($L3=0,E3,0)","v":0},{"$f":"IF($L3=0,G3,0)","v":0},{"$f":"IF($L3=0,I3,0)","v":0},{"$f":"IF($L3=0,K3,0)","v":0}]
[{"$f":"liste!A4","v":"HOLMES Sherlock"},null,1,null,0,null,0,null,0,null,0,0,1,0,0,0,0]
[{"$f":"liste!A5","v":"CHAHINE Youcef"},null,1,null,1,null,1,null,0,null,0,0,1,1,1,0,0]
[{"$f":"liste!A6","v":"NOM5"},null,null,null,null,null,null,null,null,null,null,null,0,0,0,0,0]
[{"$f":"liste!A7","v":"NOM6"},null,null,null,null,null,null,null,null,null,null,null,0,0,0,0,0]
[{"$f":"liste!A8","v":"NOM7"},null,null,null,null,null,null,null,null,null,null,null,0,0,0,0,0]
{"$rows_left_out":24}
{"sheet":"Ecrire","index":10,"n_rows":108,"n_cols":4,"rows_kept":108,"cut":false,"hidden":false,"merged":[[28,0,28,3],[29,0,29,2],[51,0,51,2],[64,0,64,2],[79,0,79,2],[95,0,95,2]]}
[]
[]
[]
[]
[]
[]
[]
[]
{"$rows_left_out":101}
{"sheet":"Comprendre","index":11,"n_rows":68,"n_cols":4,"rows_kept":68,"cut":false,"hidden":false,"merged":[[5,0,5,3],[6,0,6,2],[15,0,15,2],[47,0,47,2]]}
[]
[null,"Nom et prénom de l'élève :",{"$f":"qui","v":"PICASSO Pablo"}]
[]
[null,"Langue :",{"$f":"VLOOKUP(qui,liste!$A$2:$B$31,2,FALSE)","v":"Espagnol"}]
[]
[{"$f":"'.calc_eva'!A67","v":"Comprendre à l'oral "}]
[{"$f":"'.calc_eva'!B67","v":"Comprendre les consignes de classe."}]
[null,null,{"$f":"'.calc_eva'!C67","v":"Comprendre des consignes courtes et simples et agir en conséquence (s'asseoir, ouvrir le cahier, aller au tableau, se taire, écouter, lever la main , se ranger, se mettre en cercle...)"},{"$f":"IF('.calc_eva'!E67=0,\"\",'.calc_eva'!E67)","v":""}]
{"$rows_left_out":61}
{"sheet":"Parler","index":12,"n_rows":63,"n_cols":4,"rows_kept":63,"cut":false,"hidden":false,"merged":[[22,0,22,2],[50,0,50,2],[5,0,5,3],[6,0,6,2]]}
[]
[null,"Nom et prénom de l'élève :",{"$f":"qui","v":"PICASSO Pablo"}]
[]
[null,"Langue :",{"$f":"VLOOKUP(qui,liste!$A$2:$B$31,2,FALSE)","v":"Espagnol"}]
[]
[{"$f":"'.calc_eva'!A119","v":"Parler en continu"}]
[{"$f":"'.calc_eva'!B119","v":"Reproduire un modèle oral"}]
[null,null,{"$f":"'.calc_eva'!C119","v":"Reproduire des phrases simples fréquemment utilisées "},{"$f":"IF('.calc_eva'!E119=0,\"\",'.calc_eva'!E119)","v":""}]
{"$rows_left_out":56}
{"sheet":"Lire","index":13,"n_rows":54,"n_cols":4,"rows_kept":54,"cut":false,"hidden":false,"merged":[[5,0,5,3],[6,0,6,2],[31,0,31,2]]}
[]
[null,"Nom et prénom de l'élève :",{"$f":"qui","v":"PICASSO Pablo"}]
[]
[null,"Langue :",{"$f":"VLOOKUP(qui,liste!$A$2:$B$31,2,FALSE)","v":"Espagnol"}]
[]
[{"$f":"'.calc_eva'!A166","v":"Lire"}]
[{"$f":"'.calc_eva'!B166","v":"Comprendre des textes courts et simples en s'appuyant sur des éléments connus (indications, informations)"}]
[null,null,{"$f":"'.calc_eva'!C166","v":"Relever des noms, des mots familiers et des expressions élémentaires dans un texte "},{"$f":"IF('.calc_eva'!E166=0,\"\",'.calc_eva'!E166)","v":""}]
{"$rows_left_out":47}
{"sheet":"Dialoguer","index":14,"n_rows":78,"n_cols":4,"rows_kept":78,"cut":false,"hidden":false,"merged":[[6,0,6,2],[26,0,26,2],[41,0,41,2],[66,0,66,2],[77,1,77,2],[5,0,5,3]]}
[]
[null,"Nom et prénom de l'élève :",{"$f":"qui","v":"PICASSO Pablo"}]
[]
[null,"Langue :",{"$f":"VLOOKUP(qui,liste!$A$2:$B$31,2,FALSE)","v":"Espagnol"}]
[]
[{"$f":"'.calc_eva'!A206","v":"Réagir et dialoguer (interaction orale)"}]
[{"$f":"'.calc_eva'!B206","v":"Communiquer, au besoin avec des pauses pour chercher ses mots"}]
[null,null,{"$f":"'.calc_eva'!C206","v":"Parler du temps qu'il fait "},{"$f":"IF('.calc_eva'!E206=0,\"\",'.calc_eva'!E206)","v":""}]
{"$rows_left_out":71}
{"sheet":"synthese classe","index":15,"n_rows":163,"n_cols":3,"rows_kept":163,"cut":false,"hidden":false,"merged":[]}
["Nombre d'élèves de la classe :",{"$f":"30-COUNTIF(nomPrenom,\"NOM*\")","v":4}]
["Nombre d'élèves ayant validé le palier A1 :",{"$f":"SUM(commentaires!L2:L31)","v":2},{"$f":"B2/B1","v":0.5}]
["Parmi les élèves n'ayant pas validé le palier A1 :"]
["Nombre d'élèves ayant validé la compétence \"Ecrire\" :",{"$f":"SUM(commentaires!M2:M31)","v":2},{"$f":"B4/$B$2","v":1}]
["Liste des élèves n'ayant pas validé la compétence \"Ecrire\" :"]
[{"$f":"IF(commentaires!M2=0,commentaires!$A2,\"\")","v":"PICASSO Pablo"}]
[{"$f":"IF(commentaires!M3=0,commentaires!$A3,\"\")","v":"FREUD Sigmund"}]
[{"$f":"IF(commentaires!M4=0,commentaires!$A4,\"\")","v":""}]
{"$rows_left_out":155}