{"text_format":"1","workbook":"xlsx","n_sheets":6,"sheets":["Accueil","Parametres","Réglages","Entrée","Synthèse","Feuil1"],"not_rendered":{"charts":1,"images":1,"macros":1,"external_links":1,"defined_names":4,"comments":0,"pivot_tables":0},"unopened":[],"bounds":{"document_bytes":16777216,"sheet_cells":100000,"rows_first":2000,"rows_last":500,"rows_between":2000,"halvings":0,"cell_chars":16384,"cell_head_chars":4096},"cells_cut":0,"cells_raw":0,"read":"whole","date_system":"1900"}

{"sheet":"Accueil","index":0,"n_rows":23,"n_cols":14,"rows_kept":23,"cut":false,"hidden":false,"merged":[[21,2,22,2],[21,3,21,11],[21,12,21,14],[22,3,22,11],[22,12,22,14],[17,2,19,2],[17,3,17,14],[18,3,18,14],[19,3,19,14],[5,2,5,14],[6,2,6,14],[8,2,8,14],[11,2,11,14],[12,2,12,14],[13,2,16,2],[13,3,13,14],[14,3,14,14],[15,3,15,14],[16,3,16,14],[10,2,10,14],[4,2,4,14],[9,2,9,14],[7,2,7,14],[0,1,0,15],[2,1,2,3],[2,5,2,7],[2,9,2,11],[2,13,2,15]]}
[null,"Générateur de fiches de suivi de séquence élève    (Gain EPS)"]
[]
[null,"Avec ou sans connexion internet et synchronisé sur Nuage",null,null,"< Lien","Sur tous les appareils mobiles (Windows, Android, Apple)",null,null,null,"Suivi de séquence (fiches élèves et une synthèse automatique)",null,null,"Lien >","Vidéo de présentation"]
[]
[null,null,"Vous fonctionnez \"en petites boucles, grandes boucles\" et/ou avec des fiches, un diaporama interactif ??"]
[null,null,"Alors cette application est pour vous !!"]
[null,null,">  Quelle que soit l'activité : Une fiche de suivi de séquence par élève ou par groupe (\"Feuil1,2,...\") accessibles depuis l'onglet \"Entrée\" & une fiche \"Synthèse\" pour le professeur qui met en lumière \"comment les élèves se voient alors qu'ils sont\" et \"ce qu'il font\"."]
[null,null,">  Depuis la fiche Synthèse vous allez pouvoir définir un code secret pour chaque élève de sorte que ses données soient \"confidentielles\""]
[null,null,">  Chaque fiche \"élève\" fait apparaitre deux graphiques de progression et le positionnement du professeur, de leçon en leçon"]
[null,null,">  Vous allez pouvoir personnaliser cette application, énormément de critères et textes sont paramétrables dans l'onglet \"Réglagles\" "]
[null,null,"  Comme toutes les application GAIN EPS, seules les cellules blanches sont modifiables !"]
[null,null,"Principes "]
[null,null," Sur ordinateur et dans le logiel Excel \"de bureau\" >>  pas sur ses versions en ligne \"web\"    "]
[null,null,"Etapes à suivre","> insérez vos élèves ou groupe d'élèves dans l'onglet \"Paramètres\" "]
[null,null,null,"> Définir dans l'onglet \"Réglages\" vos axes de travail, vos situations d'apprentissages, le nombre de leçon de la séquence et +"]
[null,null,null,"> Par un simple bouton vos réglages vont prendre effet et l'ensemble des fiches élèves vont être créées automatiquement."]
[null,null,null,"> Vous aurez toujours la possibilité d'opérer quelques modifications par le bouton \"Concevoir/Déployer\" "]
[null,null,"Avec ou sans internet sur tablettes ","Sans aucune connexion internet possible quel que soit le moment :  autant de tablettes \"identifiées\" pour autant de groupes d'élèves dans la classe. Un fichier qui automatise la récupération des fiches synthèse vous est proposé ici."]
[null,null,null,"Connexion internet avant et après la leçon : même fonctionnement que sans connexion mais utilisation possible de Nextcloud (Nuage de Apps éducation) qui facilite les transferts de votre ordinateur aux tablettes. Tuto \"Nuage\" en haut de cette page à gauche"]
[null,null,null,"Connexion internet pendant la leçon : Utilisation d'une seule application pour tous les élèves de la classe avec la collaboration via un cloud. Préférez Onedrive avec votre compte microsoft enseignant, en prenant le soin d'anonymer votre liste d'élèves."]
[]
[null,null,"Nantes Groupe TraAM","Conception :  ",null,null,null,null,null,null,null,null,"Développement : "]
[null,null,null,"Bourthoumieu Sébastien IAN , Leroux Mathias IA IPR, Rabeau Grégory, Roggy Paul-Vincent",null,null,null,null,null,null,null,null,"sebastien.bourthoumieu@ac-nantes.fr"]

{"sheet":"Parametres","index":1,"n_rows":361,"n_cols":17,"rows_kept":361,"cut":false,"hidden":false,"merged":[[3,3,3,5],[4,3,4,5],[5,3,5,5]]}
["Noms ","Prénoms","Classes",null,null,null,null,null,"Classes","Classes triées",null,{"$f":"C2","v":"Classe Test"},"< Choix classe feuille 1 ","Noms Prénoms triés","Nbre Elèves"]
["Elève",1,"Classe Test",null,null,null,{"$f":"A2&\" \"&B2","v":"Elève 1"},null,{"$f":"IF(C2=\"\",\"\",C2)","v":"Classe Test"},{"$f":"IFERROR(INDEX(plage1bis,MATCH(SMALL(IF(MATCH(IF(COUNTIF(plage1bis,\"<=\"&plage1bis)=0,\"\",COUNTIF(plage1bis,\"<=\"&plage1bis)),IF(COUNTIF(plage1bis,\"<=\"&plage1bis)=0,\"\",COUNTIF(plage1bis,\"<=\"&plage1bis)),0)=ROW($1:$360),COUNTIF(plage1bis,\"<=\"&plage1bis),\"\"),ROW(I1)+1),IF(MATCH(IF(COUNTIF(plage1bis,\"<=\"&plage1bis)=0,\"\",COUNTIF(plage1bis,\"<=\"&plage1bis)),IF(COUNTIF(plage1bis,\"<=\"&plage1bis)=0,\"\",COUNTIF(plage1bis,\"<=\"&plage1bis)),0)=ROW($1:$360),COUNTIF(plage1bis,\"<=\"&plage1bis),\"\"),0)),\"\")","v":"Classe Test"},null,{"$f":"IF(C2=$L$1,G2,\"\")","v":"Elève 1"},"< Noms Prénoms Vrac ",null,{"$f":"COUNTIF(N3:N37,\">A\")+1","v":2}]
[null,null,null,null,null,null,{"$f":"A3&\" \"&B3","v":" "},null,{"$f":"IF(C3=\"\",\"\",C3)","v":""},{"$f":"IFERROR(INDEX(plage1bis,MATCH(SMALL(IF(MATCH(IF(COUNTIF(plage1bis,\"<=\"&plage1bis)=0,\"\",COUNTIF(plage1bis,\"<=\"&plage1bis)),IF(COUNTIF(plage1bis,\"<=\"&plage1bis)=0,\"\",COUNTIF(plage1bis,\"<=\"&plage1bis)),0)=ROW($1:$360),COUNTIF(plage1bis,\"<=\"&plage1bis),\"\"),ROW(I2)+1),IF(MATCH(IF(COUNTIF(plage1bis,\"<=\"&plage1bis)=0,\"\",COUNTIF(plage1bis,\"<=\"&plage1bis)),IF(COUNTIF(plage1bis,\"<=\"&plage1bis)=0,\"\",COUNTIF(plage1bis,\"<=\"&plage1bis)),0)=ROW($1:$360),COUNTIF(plage1bis,\"<=\"&plage1bis),\"\"),0)),\"\")","v":""},null,{"$f":"IF(C3=$L$1,G3,\"\")","v":""},"<",{"$f":"IFERROR(IF(COUNTA(plage1)<ROWS(N$3:N3),\"\",INDEX($L$1:$L$361,SMALL(IF(plage1<>\"\",ROW(plage1)),ROWS(N$3:N3)))),\"\")","v":"Elève 1"},null,null,{"$f":"IF(N3=\"\",\"\",N3)","v":"Elève 1"}]
[null,null,null,"A partir de la case bleue :",null,null," ",null,"",{"$f":"IFERROR(INDEX(plage1bis,MATCH(SMALL(IF(MATCH(IF(COUNTIF(plage1bis,\"<=\"&plage1bis)=0,\"\",COUNTIF(plage1bis,\"<=\"&plage1bis)),IF(COUNTIF(plage1bis,\"<=\"&plage1bis)=0,\"\",COUNTIF(plage1bis,\"<=\"&plage1bis)),0)=ROW($1:$360),COUNTIF(plage1bis,\"<=\"&plage1bis),\"\"),ROW(I3)+1),IF(MATCH(IF(COUNTIF(plage1bis,\"<=\"&plage1bis)=0,\"\",COUNTIF(plage1bis,\"<=\"&plage1bis)),IF(COUNTIF(plage1bis,\"<=\"&plage1bis)=0,\"\",COUNTIF(plage1bis,\"<=\"&plage1bis)),0)=ROW($1:$360),COUNTIF(plage1bis,\"<=\"&plage1bis),\"\"),0)),\"\")","v":""},null,"",null,{"$f":"IFERROR(IF(COUNTA(plage1)<ROWS(N$3:N4),\"\",INDEX($L$1:$L$361,SMALL(IF(plage1<>\"\",ROW(plage1)),ROWS(N$3:N4)))),\"\")","v":""},null,null,{"$f":"IF(N4=\"\",\"\",N4)","v":""}]
[null,null,null,"Collez (Valeurs) votre liste de classe ou votre groupe d'élève",null,null," ",null,"",{"$f":"IFERROR(INDEX(plage1bis,MATCH(SMALL(IF(MATCH(IF(COUNTIF(plage1bis,\"<=\"&plage1bis)=0,\"\",COUNTIF(plage1bis,\"<=\"&plage1bis)),IF(COUNTIF(plage1bis,\"<=\"&plage1bis)=0,\"\",COUNTIF(plage1bis,\"<=\"&plage1bis)),0)=ROW($1:$360),COUNTIF(plage1bis,\"<=\"&plage1bis),\"\"),ROW(I4)+1),IF(MATCH(IF(COUNTIF(plage1bis,\"<=\"&plage1bis)=0,\"\",COUNTIF(plage1bis,\"<=\"&plage1bis)),IF(COUNTIF(plage1bis,\"<=\"&plage1bis)=0,\"\",COUNTIF(plage1bis,\"<=\"&plage1bis)),0)=ROW($1:$360),COUNTIF(plage1bis,\"<=\"&plage1bis),\"\"),0)),\"\")","v":""},null,"",null,{"$f":"IFERROR(IF(COUNTA(plage1)<ROWS(N$3:N5),\"\",INDEX($L$1:$L$361,SMALL(IF(plage1<>\"\",ROW(plage1)),ROWS(N$3:N5)))),\"\")","v":""},null,null,""]
[null,null,null,"Jusqu'à 36 élèves au maximum",null,null," ",null,"",{"$f":"IFERROR(INDEX(plage1bis,MATCH(SMALL(IF(MATCH(IF(COUNTIF(plage1bis,\"<=\"&plage1bis)=0,\"\",COUNTIF(plage1bis,\"<=\"&plage1bis)),IF(COUNTIF(plage1bis,\"<=\"&plage1bis)=0,\"\",COUNTIF(plage1bis,\"<=\"&plage1bis)),0)=ROW($1:$360),COUNTIF(plage1bis,\"<=\"&plage1bis),\"\"),ROW(I5)+1),IF(MATCH(IF(COUNTIF(plage1bis,\"<=\"&plage1bis)=0,\"\",COUNTIF(plage1bis,\"<=\"&plage1bis)),IF(COUNTIF(plage1bis,\"<=\"&plage1bis)=0,\"\",COUNTIF(plage1bis,\"<=\"&plage1bis)),0)=ROW($1:$360),COUNTIF(plage1bis,\"<=\"&plage1bis),\"\"),0)),\"\")","v":""},null,"",null,{"$f":"IFERROR(IF(COUNTA(plage1)<ROWS(N$3:N6),\"\",INDEX($L$1:$L$361,SMALL(IF(plage1<>\"\",ROW(plage1)),ROWS(N$3:N6)))),\"\")","v":""},null,null,""]
[null,null,null,null,null,null," ",null,"",{"$f":"IFERROR(INDEX(plage1bis,MATCH(SMALL(IF(MATCH(IF(COUNTIF(plage1bis,\"<=\"&plage1bis)=0,\"\",COUNTIF(plage1bis,\"<=\"&plage1bis)),IF(COUNTIF(plage1bis,\"<=\"&plage1bis)=0,\"\",COUNTIF(plage1bis,\"<=\"&plage1bis)),0)=ROW($1:$360),COUNTIF(plage1bis,\"<=\"&plage1bis),\"\"),ROW(I6)+1),IF(MATCH(IF(COUNTIF(plage1bis,\"<=\"&plage1bis)=0,\"\",COUNTIF(plage1bis,\"<=\"&plage1bis)),IF(COUNTIF(plage1bis,\"<=\"&plage1bis)=0,\"\",COUNTIF(plage1bis,\"<=\"&plage1bis)),0)=ROW($1:$360),COUNTIF(plage1bis,\"<=\"&plage1bis),\"\"),0)),\"\")","v":""},null,"",null,{"$f":"IFERROR(IF(COUNTA(plage1)<ROWS(N$3:N7),\"\",INDEX($L$1:$L$361,SMALL(IF(plage1<>\"\",ROW(plage1)),ROWS(N$3:N7)))),\"\")","v":""},null,null,""]
[null,null,null,null,null,null," ",null,"",{"$f":"IFERROR(INDEX(plage1bis,MATCH(SMALL(IF(MATCH(IF(COUNTIF(plage1bis,\"<=\"&plage1bis)=0,\"\",COUNTIF(plage1bis,\"<=\"&plage1bis)),IF(COUNTIF(plage1bis,\"<=\"&plage1bis)=0,\"\",COUNTIF(plage1bis,\"<=\"&plage1bis)),0)=ROW($1:$360),COUNTIF(plage1bis,\"<=\"&plage1bis),\"\"),ROW(I7)+1),IF(MATCH(IF(COUNTIF(plage1bis,\"<=\"&plage1bis)=0,\"\",COUNTIF(plage1bis,\"<=\"&plage1bis)),IF(COUNTIF(plage1bis,\"<=\"&plage1bis)=0,\"\",COUNTIF(plage1bis,\"<=\"&plage1bis)),0)=ROW($1:$360),COUNTIF(plage1bis,\"<=\"&plage1bis),\"\"),0)),\"\")","v":""},null,"",null,{"$f":"IFERROR(IF(COUNTA(plage1)<ROWS(N$3:N8),\"\",INDEX($L$1:$L$361,SMALL(IF(plage1<>\"\",ROW(plage1)),ROWS(N$3:N8)))),\"\")","v":""},null,null,""]
[null,null,null,null,null,null," ",null,"",{"$f":"IFERROR(INDEX(plage1bis,MATCH(SMALL(IF(MATCH(IF(COUNTIF(plage1bis,\"<=\"&plage1bis)=0,\"\",COUNTIF(plage1bis,\"<=\"&plage1bis)),IF(COUNTIF(plage1bis,\"<=\"&plage1bis)=0,\"\",COUNTIF(plage1bis,\"<=\"&plage1bis)),0)=ROW($1:$360),COUNTIF(plage1bis,\"<=\"&plage1bis),\"\"),ROW(I8)+1),IF(MATCH(IF(COUNTIF(plage1bis,\"<=\"&plage1bis)=0,\"\",COUNTIF(plage1bis,\"<=\"&plage1bis)),IF(COUNTIF(plage1bis,\"<=\"&plage1bis)=0,\"\",COUNTIF(plage1bis,\"<=\"&plage1bis)),0)=ROW($1:$360),COUNTIF(plage1bis,\"<=\"&plage1bis),\"\"),0)),\"\")","v":""},null,"",null,{"$f":"IFERROR(IF(COUNTA(plage1)<ROWS(N$3:N9),\"\",INDEX($L$1:$L$361,SMALL(IF(plage1<>\"\",ROW(plage1)),ROWS(N$3:N9)))),\"\")","v":""},null,null,""]
[null,null,null,null,null,null," ",null,"",{"$f":"IFERROR(INDEX(plage1bis,MATCH(SMALL(IF(MATCH(IF(COUNTIF(plage1bis,\"<=\"&plage1bis)=0,\"\",COUNTIF(plage1bis,\"<=\"&plage1bis)),IF(COUNTIF(plage1bis,\"<=\"&plage1bis)=0,\"\",COUNTIF(plage1bis,\"<=\"&plage1bis)),0)=ROW($1:$360),COUNTIF(plage1bis,\"<=\"&plage1bis),\"\"),ROW(I9)+1),IF(MATCH(IF(COUNTIF(plage1bis,\"<=\"&plage1bis)=0,\"\",COUNTIF(plage1bis,\"<=\"&plage1bis)),IF(COUNTIF(plage1bis,\"<=\"&plage1bis)=0,\"\",COUNTIF(plage1bis,\"<=\"&plage1bis)),0)=ROW($1:$360),COUNTIF(plage1bis,\"<=\"&plage1bis),\"\"),0)),\"\")","v":""},null,"",null,{"$f":"IFERROR(IF(COUNTA(plage1)<ROWS(N$3:N10),\"\",INDEX($L$1:$L$361,SMALL(IF(plage1<>\"\",ROW(plage1)),ROWS(N$3:N10)))),\"\")","v":""},null,null,""]
[null,null,null,null,null,null," ",null,"",{"$f":"IFERROR(INDEX(plage1bis,MATCH(SMALL(IF(MATCH(IF(COUNTIF(plage1bis,\"<=\"&plage1bis)=0,\"\",COUNTIF(plage1bis,\"<=\"&plage1bis)),IF(COUNTIF(plage1bis,\"<=\"&plage1bis)=0,\"\",COUNTIF(plage1bis,\"<=\"&plage1bis)),0)=ROW($1:$360),COUNTIF(plage1bis,\"<=\"&plage1bis),\"\"),ROW(I10)+1),IF(MATCH(IF(COUNTIF(plage1bis,\"<=\"&plage1bis)=0,\"\",COUNTIF(plage1bis,\"<=\"&plage1bis)),IF(COUNTIF(plage1bis,\"<=\"&plage1bis)=0,\"\",COUNTIF(plage1bis,\"<=\"&plage1bis)),0)=ROW($1:$360),COUNTIF(plage1bis,\"<=\"&plage1bis),\"\"),0)),\"\")","v":""},null,"",null,{"$f":"IFERROR(IF(COUNTA(plage1)<ROWS(N$3:N11),\"\",INDEX($L$1:$L$361,SMALL(IF(plage1<>\"\",ROW(plage1)),ROWS(N$3:N11)))),\"\")","v":""},null,null,""]
[null,null,null,null,null,null," ",null,"",null,null,"",null,{"$f":"IFERROR(IF(COUNTA(plage1)<ROWS(N$3:N12),\"\",INDEX($L$1:$L$361,SMALL(IF(plage1<>\"\",ROW(plage1)),ROWS(N$3:N12)))),\"\")","v":""},null,null,""]
[null,null,null,null,null,null," ",null,"",null,null,"",null,{"$f":"IFERROR(IF(COUNTA(plage1)<ROWS(N$3:N13),\"\",INDEX($L$1:$L$361,SMALL(IF(plage1<>\"\",ROW(plage1)),ROWS(N$3:N13)))),\"\")","v":""},null,null,""]
[null,null,null,null,null,null," ",null,"",null,null,"",null,{"$f":"IFERROR(IF(COUNTA(plage1)<ROWS(N$3:N14),\"\",INDEX($L$1:$L$361,SMALL(IF(plage1<>\"\",ROW(plage1)),ROWS(N$3:N14)))),\"\")","v":""},null,null,""]
[null,null,null,null,null,null," ",null,"",null,null,"",null,{"$f":"IFERROR(IF(COUNTA(plage1)<ROWS(N$3:N15),\"\",INDEX($L$1:$L$361,SMALL(IF(plage1<>\"\",ROW(plage1)),ROWS(N$3:N15)))),\"\")","v":""},null,null,""]
[null,null,null,null,null,null," ",null,"",null,null,"",null,{"$f":"IFERROR(IF(COUNTA(plage1)<ROWS(N$3:N16),\"\",INDEX($L$1:$L$361,SMALL(IF(plage1<>\"\",ROW(plage1)),ROWS(N$3:N16)))),\"\")","v":""},null,null,""]
[null,null,null,null,null,null," ",null,"",null,null,"",null,{"$f":"IFERROR(IF(COUNTA(plage1)<ROWS(N$3:N17),\"\",INDEX($L$1:$L$361,SMALL(IF(plage1<>\"\",ROW(plage1)),ROWS(N$3:N17)))),\"\")","v":""},null,null,""]
[null,null,null,null,null,null," ",null,"",null,null,"",null,{"$f":"IFERROR(IF(COUNTA(plage1)<ROWS(N$3:N18),\"\",INDEX($L$1:$L$361,SMALL(IF(plage1<>\"\",ROW(plage1)),ROWS(N$3:N18)))),\"\")","v":""},null,null,""]
[null,null,null,null,null,null," ",null,"",null,null,"",null,{"$f":"IFERROR(IF(COUNTA(plage1)<ROWS(N$3:N19),\"\",INDEX($L$1:$L$361,SMALL(IF(plage1<>\"\",ROW(plage1)),ROWS(N$3:N19)))),\"\")","v":""},null,null,""]
[null,null,null,null,null,null," ",null,"",null,null,"",null,{"$f":"IFERROR(IF(COUNTA(plage1)<ROWS(N$3:N20),\"\",INDEX($L$1:$L$361,SMALL(IF(plage1<>\"\",ROW(plage1)),ROWS(N$3:N20)))),\"\")","v":""},null,null,""]
[null,null,null,null,null,null," ",null,"",null,null,"",null,{"$f":"IFERROR(IF(COUNTA(plage1)<ROWS(N$3:N21),\"\",INDEX($L$1:$L$361,SMALL(IF(plage1<>\"\",ROW(plage1)),ROWS(N$3:N21)))),\"\")","v":""},null,null,""]
[null,null,null,null,null,null," ",null,"",null,null,"",null,{"$f":"IFERROR(IF(COUNTA(plage1)<ROWS(N$3:N22),\"\",INDEX($L$1:$L$361,SMALL(IF(plage1<>\"\",ROW(plage1)),ROWS(N$3:N22)))),\"\")","v":""},null,null,""]
[null,null,null,null,null,null," ",null,"",null,null,"",null,{"$f":"IFERROR(IF(COUNTA(plage1)<ROWS(N$3:N23),\"\",INDEX($L$1:$L$361,SMALL(IF(plage1<>\"\",ROW(plage1)),ROWS(N$3:N23)))),\"\")","v":""},null,null,""]
[null,null,null,null,null,null," ",null,"",null,null,"",null,{"$f":"IFERROR(IF(COUNTA(plage1)<ROWS(N$3:N24),\"\",INDEX($L$1:$L$361,SMALL(IF(plage1<>\"\",ROW(plage1)),ROWS(N$3:N24)))),\"\")","v":""},null,null,""]
[null,null,null,null,null,null," ",null,"",null,null,"",null,{"$f":"IFERROR(IF(COUNTA(plage1)<ROWS(N$3:N25),\"\",INDEX($L$1:$L$361,SMALL(IF(plage1<>\"\",ROW(plage1)),ROWS(N$3:N25)))),\"\")","v":""},null,null,""]
[null,null,null,null,null,null," ",null,"",null,null,"",null,{"$f":"IFERROR(IF(COUNTA(plage1)<ROWS(N$3:N26),\"\",INDEX($L$1:$L$361,SMALL(IF(plage1<>\"\",ROW(plage1)),ROWS(N$3:N26)))),\"\")","v":""},null,null,""]
[null,null,null,null,null,null," ",null,"",null,null,"",null,{"$f":"IFERROR(IF(COUNTA(plage1)<ROWS(N$3:N27),\"\",INDEX($L$1:$L$361,SMALL(IF(plage1<>\"\",ROW(plage1)),ROWS(N$3:N27)))),\"\")","v":""},null,null,""]
[null,null,null,null,null,null," ",null,"",null,null,"",null,{"$f":"IFERROR(IF(COUNTA(plage1)<ROWS(N$3:N28),\"\",INDEX($L$1:$L$361,SMALL(IF(plage1<>\"\",ROW(plage1)),ROWS(N$3:N28)))),\"\")","v":""},null,null,""]
[null,null,null,null,null,null," ",null,"",null,null,"",null,{"$f":"IFERROR(IF(COUNTA(plage1)<ROWS(N$3:N29),\"\",INDEX($L$1:$L$361,SMALL(IF(plage1<>\"\",ROW(plage1)),ROWS(N$3:N29)))),\"\")","v":""},null,null,""]
[null,null,null,null,null,null," ",null,"",null,null,"",null,{"$f":"IFERROR(IF(COUNTA(plage1)<ROWS(N$3:N30),\"\",INDEX($L$1:$L$361,SMALL(IF(plage1<>\"\",ROW(plage1)),ROWS(N$3:N30)))),\"\")","v":""},null,null,""]
[null,null,null,null,null,null," ",null,"",null,null,"",null,{"$f":"IFERROR(IF(COUNTA(plage1)<ROWS(N$3:N31),\"\",INDEX($L$1:$L$361,SMALL(IF(plage1<>\"\",ROW(plage1)),ROWS(N$3:N31)))),\"\")","v":""},null,null,""]
[null,null,null,null,null,null," ",null,"",null,null,"",null,{"$f":"IFERROR(IF(COUNTA(plage1)<ROWS(N$3:N32),\"\",INDEX($L$1:$L$361,SMALL(IF(plage1<>\"\",ROW(plage1)),ROWS(N$3:N32)))),\"\")","v":""},null,null,""]
[null,null,null,null,null,null," ",null,"",null,null,"",null,{"$f":"IFERROR(IF(COUNTA(plage1)<ROWS(N$3:N33),\"\",INDEX($L$1:$L$361,SMALL(IF(plage1<>\"\",ROW(plage1)),ROWS(N$3:N33)))),\"\")","v":""},null,null,""]
[null,null,null,null,null,null," ",null,"",null,null,"",null,{"$f":"IFERROR(IF(COUNTA(plage1)<ROWS(N$3:N34),\"\",INDEX($L$1:$L$361,SMALL(IF(plage1<>\"\",ROW(plage1)),ROWS(N$3:N34)))),\"\")","v":""},null,null,""]
[null,null,null,null,null,null," ",null,"",null,null,"",null,{"$f":"IFERROR(IF(COUNTA(plage1)<ROWS(N$3:N35),\"\",INDEX($L$1:$L$361,SMALL(IF(plage1<>\"\",ROW(plage1)),ROWS(N$3:N35)))),\"\")","v":""},null,null,""]
[null,null,null,null,null,null," ",null,"",null,null,"",null,{"$f":"IFERROR(IF(COUNTA(plage1)<ROWS(N$3:N36),\"\",INDEX($L$1:$L$361,SMALL(IF(plage1<>\"\",ROW(plage1)),ROWS(N$3:N36)))),\"\")","v":""},null,null,""]
[null,null,null,null,null,null," ",null,"",null,null,"",null,{"$f":"IFERROR(IF(COUNTA(plage1)<ROWS(N$3:N37),\"\",INDEX($L$1:$L$361,SMALL(IF(plage1<>\"\",ROW(plage1)),ROWS(N$3:N37)))),\"\")","v":""},null,null,""]
[null,null,null,null,null,null," ",null,"",null,null,"",null,{"$f":"IFERROR(IF(COUNTA(plage1)<ROWS(N$3:N38),\"\",INDEX($L$1:$L$361,SMALL(IF(plage1<>\"\",ROW(plage1)),ROWS(N$3:N38)))),\"\")","v":""},null,null,""]
[null,null,null,null,null,null," ",null,"",null,null,"",null,{"$f":"IFERROR(IF(COUNTA(plage1)<ROWS(N$3:N39),\"\",INDEX($L$1:$L$361,SMALL(IF(plage1<>\"\",ROW(plage1)),ROWS(N$3:N39)))),\"\")","v":""},null,null,{"$f":"COUNTBLANK(Q3:Q38)","v":35}]
[null,null,null,null,null,null," ",null,"",null,null,"",null,{"$f":"IFERROR(IF(COUNTA(plage1)<ROWS(N$3:N40),\"\",INDEX($L$1:$L$361,SMALL(IF(plage1<>\"\",ROW(plage1)),ROWS(N$3:N40)))),\"\")","v":""}]
[null,null,null,null,null,null," ",null,"",null,null,"",null,{"$f":"IFERROR(IF(COUNTA(plage1)<ROWS(N$3:N41),\"\",INDEX($L$1:$L$361,SMALL(IF(plage1<>\"\",ROW(plage1)),ROWS(N$3:N41)))),\"\")","v":""}]
[null,null,null,null,null,null," ",null,"",null,null,""]
[null,null,null,null,null,null," ",null,"",null,null,""]
[null,null,null,null,null,null," ",null,"",null,null,""]
[null,null,null,null,null,null," ",null,"",null,null,""]
[null,null,null,null,null,null," ",null,"",null,null,""]
[null,null,null,null,null,null," ",null,"",null,null,""]
[null,null,null,null,null,null," ",null,"",null,null,""]
[null,null,null,null,null,null," ",null,"",null,null,""]
[null,null,null,null,null,null," ",null,"",null,null,""]
[null,null,null,null,null,null," ",null,"",null,null,""]
[null,null,null,null,null,null," ",null,"",null,null,""]
[null,null,null,null,null,null," ",null,"",null,null,""]
[null,null,null,null,null,null," ",null,"",null,null,""]
[null,null,null,null,null,null," ",null,"",null,null,""]
[null,null,null,null,null,null," ",null,"",null,null,""]
[null,null,null,null,null,null," ",null,"",null,null,""]
[null,null,null,null,null,null," ",null,"",null,null,""]
[null,null,null,null,null,null," ",null,"",null,null,""]
[null,null,null,null,null,null," ",null,"",null,null,""]
[null,null,null,null,null,null," ",null,"",null,null,""]
[null,null,null,null,null,null," ",null,"",null,null,""]
[null,null,null,null,null,null," ",null,"",null,null,""]
[null,null,null,null,null,null," ",null,"",null,null,""]
[null,null,null,null,null,null," ",null,"",null,null,""]
[null,null,null,null,null,null," ",null,"",null,null,""]
[null,null,null,null,null,null,{"$f":"A67&\" \"&B67","v":" "},null,{"$f":"IF(C67=\"\",\"\",C67)","v":""},null,null,{"$f":"IF(C67=$L$1,G67,\"\")","v":""}]
[null,null,null,null,null,null," ",null,"",null,null,""]
[null,null,null,null,null,null," ",null,"",null,null,""]
[null,null,null,null,null,null," ",null,"",null,null,""]
[null,null,null,null,null,null," ",null,"",null,null,""]
[null,null,null,null,null,null," ",null,"",null,null,""]
[null,null,null,null,null,null," ",null,"",null,null,""]
[null,null,null,null,null,null," ",null,"",null,null,""]
[null,null,null,null,null,null," ",null,"",null,null,""]
[null,null,null,null,null,null," ",null,"",null,null,""]
[null,null,null,null,null,null," ",null,"",null,null,""]
[null,null,null,null,null,null," ",null,"",null,null,""]
[null,null,null,null,null,null," ",null,"",null,null,""]
[null,null,null,null,null,null," ",null,"",null,null,""]
[null,null,null,null,null,null," ",null,"",null,null,""]
[null,null,null,null,null,null," ",null,"",null,null,""]
[null,null,null,null,null,null," ",null,"",null,null,""]
[null,null,null,null,null,null," ",null,"",null,null,""]
[null,null,null,null,null,null," ",null,"",null,null,""]
[null,null,null,null,null,null," ",null,"",null,null,""]
[null,null,null,null,null,null," ",null,"",null,null,""]
[null,null,null,null,null,null," ",null,"",null,null,""]
[null,null,null,null,null,null," ",null,"",null,null,""]
[null,null,null,null,null,null," ",null,"",null,null,""]
[null,null,null,null,null,null," ",null,"",null,null,""]
[null,null,null,null,null,null," ",null,"",null,null,""]
[null,null,null,null,null,null," ",null,"",null,null,""]
[null,null,null,null,null,null," ",null,"",null,null,""]
[null,null,null,null,null,null," ",null,"",null,null,""]
[null,null,null,null,null,null," ",null,"",null,null,""]
[null,null,null,null,null,null," ",null,"",null,null,""]
[null,null,null,null,null,null," ",null,"",null,null,""]
[null,null,null,null,null,null," ",null,"",null,null,""]
[null,null,null,null,null,null," ",null,"",null,null,""]
[null,null,null,null,null,null," ",null,"",null,null,""]
[null,null,null,null,null,null," ",null,"",null,null,""]
[null,null,null,null,null,null," ",null,"",null,null,""]
[null,null,null,null,null,null," ",null,"",null,null,""]
[null,null,null,null,null,null," ",null,"",null,null,""]
[null,null,null,null,null,null," ",null,"",null,null,""]
[null,null,null,null,null,null," ",null,"",null,null,""]
[null,null,null,null,null,null," ",null,"",null,null,""]
[null,null,null,null,null,null," ",null,"",null,null,""]
[null,null,null,null,null,null," ",null,"",null,null,""]
[null,null,null,null,null,null," ",null,"",null,null,""]
[null,null,null,null,null,null," ",null,"",null,null,""]
[null,null,null,null,null,null," ",null,"",null,null,""]
[null,null,null,null,null,null," ",null,"",null,null,""]
[null,null,null,null,null,null," ",null,"",null,null,""]
[null,null,null,null,null,null," ",null,"",null,null,""]
[null,null,null,null,null,null," ",null,"",null,null,""]
[null,null,null,null,null,null," ",null,"",null,null,""]
[null,null,null,null,null,null," ",null,"",null,null,""]
[null,null,null,null,null,null," ",null,"",null,null,""]
[null,null,null,null,null,null," ",null,"",null,null,""]
[null,null,null,null,null,null," ",null,"",null,null,""]
[null,null,null,null,null,null," ",null,"",null,null,""]
[null,null,null,null,null,null," ",null,"",null,null,""]
[null,null,null,null,null,null," ",null,"",null,null,""]
[null,null,null,null,null,null," ",null,"",null,null,""]
[null,null,null,null,null,null," ",null,"",null,null,""]
[null,null,null,null,null,null," ",null,"",null,null,""]
[null,null,null,null,null,null," ",null,"",null,null,""]
[null,null,null,null,null,null," ",null,"",null,null,""]
[null,null,null,null,null,null,{"$f":"A131&\" \"&B131","v":" "},null,{"$f":"IF(C131=\"\",\"\",C131)","v":""},null,null,{"$f":"IF(C131=$L$1,G131,\"\")","v":""}]
[null,null,null,null,null,null," ",null,"",null,null,""]
[null,null,null,null,null,null," ",null,"",null,null,""]
[null,null,null,null,null,null," ",null,"",null,null,""]
[null,null,null,null,null,null," ",null,"",null,null,""]
[null,null,null,null,null,null," ",null,"",null,null,""]
[null,null,null,null,null,null," ",null,"",null,null,""]
[null,null,null,null,null,null," ",null,"",null,null,""]
[null,null,null,null,null,null," ",null,"",null,null,""]
[null,null,null,null,null,null," ",null,"",null,null,""]
[null,null,null,null,null,null," ",null,"",null,null,""]
[null,null,null,null,null,null," ",null,"",null,null,""]
[null,null,null,null,null,null," ",null,"",null,null,""]
[null,null,null,null,null,null," ",null,"",null,null,""]
[null,null,null,null,null,null," ",null,"",null,null,""]
[null,null,null,null,null,null," ",null,"",null,null,""]
[null,null,null,null,null,null," ",null,"",null,null,""]
[null,null,null,null,null,null," ",null,"",null,null,""]
[null,null,null,null,null,null," ",null,"",null,null,""]
[null,null,null,null,null,null," ",null,"",null,null,""]
[null,null,null,null,null,null," ",null,"",null,null,""]
[null,null,null,null,null,null," ",null,"",null,null,""]
[null,null,null,null,null,null," ",null,"",null,null,""]
[null,null,null,null,null,null," ",null,"",null,null,""]
[null,null,null,null,null,null," ",null,"",null,null,""]
[null,null,null,null,null,null," ",null,"",null,null,""]
[null,null,null,null,null,null," ",null,"",null,null,""]
[null,null,null,null,null,null," ",null,"",null,null,""]
[null,null,null,null,null,null," ",null,"",null,null,""]
[null,null,null,null,null,null," ",null,"",null,null,""]
[null,null,null,null,null,null," ",null,"",null,null,""]
[null,null,null,null,null,null," ",null,"",null,null,""]
[null,null,null,null,null,null," ",null,"",null,null,""]
[null,null,null,null,null,null," ",null,"",null,null,""]
[null,null,null,null,null,null," ",null,"",null,null,""]
[null,null,null,null,null,null," ",null,"",null,null,""]
[null,null,null,null,null,null," ",null,"",null,null,""]
[null,null,null,null,null,null," ",null,"",null,null,""]
[null,null,null,null,null,null," ",null,"",null,null,""]
[null,null,null,null,null,null," ",null,"",null,null,""]
[null,null,null,null,null,null," ",null,"",null,null,""]
[null,null,null,null,null,null," ",null,"",null,null,""]
[null,null,null,null,null,null," ",null,"",null,null,""]
[null,null,null,null,null,null," ",null,"",null,null,""]
[null,null,null,null,null,null," ",null,"",null,null,""]
[null,null,null,null,null,null," ",null,"",null,null,""]
[null,null,null,null,null,null," ",null,"",null,null,""]
[null,null,null,null,null,null," ",null,"",null,null,""]
[null,null,null,null,null,null," ",null,"",null,null,""]
[null,null,null,null,null,null," ",null,"",null,null,""]
[null,null,null,null,null,null," ",null,"",null,null,""]
[null,null,null,null,null,null," ",null,"",null,null,""]
[null,null,null,null,null,null," ",null,"",null,null,""]
[null,null,null,null,null,null," ",null,"",null,null,""]
[null,null,null,null,null,null," ",null,"",null,null,""]
[null,null,null,null,null,null," ",null,"",null,null,""]
[null,null,null,null,null,null," ",null,"",null,null,""]
[null,null,null,null,null,null," ",null,"",null,null,""]
[null,null,null,null,null,null," ",null,"",null,null,""]
[null,null,null,null,null,null," ",null,"",null,null,""]
[null,null,null,null,null,null," ",null,"",null,null,""]
[null,null,null,null,null,null," ",null,"",null,null,""]
[null,null,null,null,null,null," ",null,"",null,null,""]
[null,null,null,null,null,null," ",null,"",null,null,""]
[null,null,null,null,null,null,{"$f":"A195&\" \"&B195","v":" "},null,{"$f":"IF(C195=\"\",\"\",C195)","v":""},null,null,{"$f":"IF(C195=$L$1,G195,\"\")","v":""}]
[null,null,null,null,null,null," ",null,"",null,null,""]
[null,null,null,null,null,null," ",null,"",null,null,""]
[null,null,null,null,null,null," ",null,"",null,null,""]
[null,null,null,null,null,null," ",null,"",null,null,""]
[null,null,null,null,null,null," ",null,"",null,null,""]
[null,null,null,null,null,null," ",null,"",null,null,""]
[null,null,null,null,null,null," ",null,"",null,null,""]
[null,null,null,null,null,null," ",null,"",null,null,""]
[null,null,null,null,null,null," ",null,"",null,null,""]
[null,null,null,null,null,null," ",null,"",null,null,""]
[null,null,null,null,null,null," ",null,"",null,null,""]
[null,null,null,null,null,null," ",null,"",null,null,""]
[null,null,null,null,null,null," ",null,"",null,null,""]
[null,null,null,null,null,null," ",null,"",null,null,""]
[null,null,null,null,null,null," ",null,"",null,null,""]
[null,null,null,null,null,null," ",null,"",null,null,""]
[null,null,null,null,null,null," ",null,"",null,null,""]
[null,null,null,null,null,null," ",null,"",null,null,""]
[null,null,null,null,null,null," ",null,"",null,null,""]
[null,null,null,null,null,null," ",null,"",null,null,""]
[null,null,null,null,null,null," ",null,"",null,null,""]
[null,null,null,null,null,null," ",null,"",null,null,""]
[null,null,null,null,null,null," ",null,"",null,null,""]
[null,null,null,null,null,null," ",null,"",null,null,""]
[null,null,null,null,null,null," ",null,"",null,null,""]
[null,null,null,null,null,null," ",null,"",null,null,""]
[null,null,null,null,null,null," ",null,"",null,null,""]
[null,null,null,null,null,null," ",null,"",null,null,""]
[null,null,null,null,null,null," ",null,"",null,null,""]
[null,null,null,null,null,null," ",null,"",null,null,""]
[null,null,null,null,null,null," ",null,"",null,null,""]
[null,null,null,null,null,null," ",null,"",null,null,""]
[null,null,null,null,null,null," ",null,"",null,null,""]
[null,null,null,null,null,null," ",null,"",null,null,""]
[null,null,null,null,null,null," ",null,"",null,null,""]
[null,null,null,null,null,null," ",null,"",null,null,""]
[null,null,null,null,null,null," ",null,"",null,null,""]
[null,null,null,null,null,null," ",null,"",null,null,""]
[null,null,null,null,null,null," ",null,"",null,null,""]
[null,null,null,null,null,null," ",null,"",null,null,""]
[null,null,null,null,null,null," ",null,"",null,null,""]
[null,null,null,null,null,null," ",null,"",null,null,""]
[null,null,null,null,null,null," ",null,"",null,null,""]
[null,null,null,null,null,null," ",null,"",null,null,""]
[null,null,null,null,null,null," ",null,"",null,null,""]
[null,null,null,null,null,null," ",null,"",null,null,""]
[null,null,null,null,null,null," ",null,"",null,null,""]
[null,null,null,null,null,null," ",null,"",null,null,""]
[null,null,null,null,null,null," ",null,"",null,null,""]
[null,null,null,null,null,null," ",null,"",null,null,""]
[null,null,null,null,null,null," ",null,"",null,null,""]
[null,null,null,null,null,null," ",null,"",null,null,""]
[null,null,null,null,null,null," ",null,"",null,null,""]
[null,null,null,null,null,null," ",null,"",null,null,""]
[null,null,null,null,null,null," ",null,"",null,null,""]
[null,null,null,null,null,null," ",null,"",null,null,""]
[null,null,null,null,null,null," ",null,"",null,null,""]
[null,null,null,null,null,null," ",null,"",null,null,""]
[null,null,null,null,null,null," ",null,"",null,null,""]
[null,null,null,null,null,null," ",null,"",null,null,""]
[null,null,null,null,null,null," ",null,"",null,null,""]
[null,null,null,null,null,null," ",null,"",null,null,""]
[null,null,null,null,null,null," ",null,"",null,null,""]
[null,null,null,null,null,null,{"$f":"A259&\" \"&B259","v":" "},null,{"$f":"IF(C259=\"\",\"\",C259)","v":""},null,null,{"$f":"IF(C259=$L$1,G259,\"\")","v":""}]
[null,null,null,null,null,null," ",null,"",null,null,""]
[null,null,null,null,null,null," ",null,"",null,null,""]
[null,null,null,null,null,null," ",null,"",null,null,""]
[null,null,null,null,null,null," ",null,"",null,null,""]
[null,null,null,null,null,null," ",null,"",null,null,""]
[null,null,null,null,null,null," ",null,"",null,null,""]
[null,null,null,null,null,null," ",null,"",null,null,""]
[null,null,null,null,null,null," ",null,"",null,null,""]
[null,null,null,null,null,null," ",null,"",null,null,""]
[null,null,null,null,null,null," ",null,"",null,null,""]
[null,null,null,null,null,null," ",null,"",null,null,""]
[null,null,null,null,null,null," ",null,"",null,null,""]
[null,null,null,null,null,null," ",null,"",null,null,""]
[null,null,null,null,null,null," ",null,"",null,null,""]
[null,null,null,null,null,null," ",null,"",null,null,""]
[null,null,null,null,null,null," ",null,"",null,null,""]
[null,null,null,null,null,null," ",null,"",null,null,""]
[null,null,null,null,null,null," ",null,"",null,null,""]
[null,null,null,null,null,null," ",null,"",null,null,""]
[null,null,null,null,null,null," ",null,"",null,null,""]
[null,null,null,null,null,null," ",null,"",null,null,""]
[null,null,null,null,null,null," ",null,"",null,null,""]
[null,null,null,null,null,null," ",null,"",null,null,""]
[null,null,null,null,null,null," ",null,"",null,null,""]
[null,null,null,null,null,null," ",null,"",null,null,""]
[null,null,null,null,null,null," ",null,"",null,null,""]
[null,null,null,null,null,null," ",null,"",null,null,""]
[null,null,null,null,null,null," ",null,"",null,null,""]
[null,null,null,null,null,null," ",null,"",null,null,""]
[null,null,null,null,null,null," ",null,"",null,null,""]
[null,null,null,null,null,null," ",null,"",null,null,""]
[null,null,null,null,null,null," ",null,"",null,null,""]
[null,null,null,null,null,null," ",null,"",null,null,""]
[null,null,null,null,null,null," ",null,"",null,null,""]
[null,null,null,null,null,null," ",null,"",null,null,""]
[null,null,null,null,null,null," ",null,"",null,null,""]
[null,null,null,null,null,null," ",null,"",null,null,""]
[null,null,null,null,null,null," ",null,"",null,null,""]
[null,null,null,null,null,null," ",null,"",null,null,""]
[null,null,null,null,null,null," ",null,"",null,null,""]
[null,null,null,null,null,null," ",null,"",null,null,""]
[null,null,null,null,null,null," ",null,"",null,null,""]
[null,null,null,null,null,null," ",null,"",null,null,""]
[null,null,null,null,null,null," ",null,"",null,null,""]
[null,null,null,null,null,null," ",null,"",null,null,""]
[null,null,null,null,null,null," ",null,"",null,null,""]
[null,null,null,null,null,null," ",null,"",null,null,""]
[null,null,null,null,null,null," ",null,"",null,null,""]
[null,null,null,null,null,null," ",null,"",null,null,""]
[null,null,null,null,null,null," ",null,"",null,null,""]
[null,null,null,null,null,null," ",null,"",null,null,""]
[null,null,null,null,null,null," ",null,"",null,null,""]
[null,null,null,null,null,null," ",null,"",null,null,""]
[null,null,null,null,null,null," ",null,"",null,null,""]
[null,null,null,null,null,null," ",null,"",null,null,""]
[null,null,null,null,null,null," ",null,"",null,null,""]
[null,null,null,null,null,null," ",null,"",null,null,""]
[null,null,null,null,null,null," ",null,"",null,null,""]
[null,null,null,null,null,null," ",null,"",null,null,""]
[null,null,null,null,null,null," ",null,"",null,null,""]
[null,null,null,null,null,null," ",null,"",null,null,""]
[null,null,null,null,null,null," ",null,"",null,null,""]
[null,null,null,null,null,null," ",null,"",null,null,""]
[null,null,null,null,null,null,{"$f":"A323&\" \"&B323","v":" "},null,{"$f":"IF(C323=\"\",\"\",C323)","v":""},null,null,{"$f":"IF(C323=$L$1,G323,\"\")","v":""}]
[null,null,null,null,null,null," ",null,"",null,null,""]
[null,null,null,null,null,null," ",null,"",null,null,""]
[null,null,null,null,null,null," ",null,"",null,null,""]
[null,null,null,null,null,null," ",null,"",null,null,""]
[null,null,null,null,null,null," ",null,"",null,null,""]
[null,null,null,null,null,null," ",null,"",null,null,""]
[null,null,null,null,null,null," ",null,"",null,null,""]
[null,null,null,null,null,null," ",null,"",null,null,""]
[null,null,null,null,null,null," ",null,"",null,null,""]
[null,null,null,null,null,null," ",null,"",null,null,""]
[null,null,null,null,null,null," ",null,"",null,null,""]
[null,null,null,null,null,null," ",null,"",null,null,""]
[null,null,null,null,null,null," ",null,"",null,null,""]
[null,null,null,null,null,null," ",null,"",null,null,""]
[null,null,null,null,null,null," ",null,"",null,null,""]
[null,null,null,null,null,null," ",null,"",null,null,""]
[null,null,null,null,null,null," ",null,"",null,null,""]
[null,null,null,null,null,null," ",null,"",null,null,""]
[null,null,null,null,null,null," ",null,"",null,null,""]
[null,null,null,null,null,null," ",null,"",null,null,""]
[null,null,null,null,null,null," ",null,"",null,null,""]
[null,null,null,null,null,null," ",null,"",null,null,""]
[null,null,null,null,null,null," ",null,"",null,null,""]
[null,null,null,null,null,null," ",null,"",null,null,""]
[null,null,null,null,null,null," ",null,"",null,null,""]
[null,null,null,null,null,null," ",null,"",null,null,""]
[null,null,null,null,null,null," ",null,"",null,null,""]
[null,null,null,null,null,null," ",null,"",null,null,""]
[null,null,null,null,null,null," ",null,"",null,null,""]
[null,null,null,null,null,null," ",null,"",null,null,""]
[null,null,null,null,null,null," ",null,"",null,null,""]
[null,null,null,null,null,null," ",null,"",null,null,""]
[null,null,null,null,null,null," ",null,"",null,null,""]
[null,null,null,null,null,null," ",null,"",null,null,""]
[null,null,null,null,null,null," ",null,"",null,null,""]
[null,null,null,null,null,null," ",null,"",null,null,""]
[null,null,null,null,null,null," ",null,"",null,null,""]
[null,null,null,null,null,null," ",null,"",null,null,""]

{"sheet":"Réglages","index":2,"n_rows":61,"n_cols":34,"rows_kept":61,"cut":false,"hidden":false,"merged":[[59,1,59,8],[60,1,60,8],[49,1,49,2],[55,1,55,8],[56,1,56,3],[56,5,56,8],[53,3,53,4],[52,3,52,4],[51,3,51,4],[50,3,50,4],[53,1,53,2],[52,1,52,2],[50,1,51,2],[57,7,57,8],[58,7,58,8],[58,1,58,4],[0,0,0,9],[1,0,1,9],[8,1,8,8],[12,1,12,8],[10,1,10,8],[6,1,6,8],[4,1,4,8],[2,1,2,8],[3,1,3,8],[30,0,39,0],[17,1,17,8],[49,3,49,4],[48,1,48,8],[57,1,57,4],[49,7,49,8],[51,5,51,6],[50,5,50,6],[49,5,49,6],[53,7,53,8],[52,7,52,8],[51,7,51,8],[53,5,53,6],[52,5,52,6],[50,7,50,8]]}
["Réglages ",null,null,null,null,null,null,null,null,null,null,null,null,null,null,null,null,null,null,null,null,null,null,null,null,{"$f":"IF(B8=\"\",\"\",B8)","v":"Le serveur "},{"$f":"IF(C8=\"\",\"\",C8)","v":"Observateur"},"?","","","","","",{"$f":"+COUNTBLANK(Z1:AG1)","v":5}]
["Sur cet onglet vous allez pouvoir personnaliser votre application",null,null,null,null,null,null,null,null,null,null,null,null,null,null,null,null,null,null,null,null,null,null,null,null,"Axe_1","Axe_2","Axe_3","Axe_4","Axe_5","Axe_6","Axe_7","Axe_8"]
[null,"Sur ordinateur et dans le logiel Excel \"de bureau\" >>  pas sur ses versions en ligne \"web\"",null,null,null,null,null,null,null,null,null,null,null,null,null,null,null,null,null,null,null,null,null,null,null,{"$f":"IF(B19=\"\",\"\",B19)","v":"exemple : sit niv1"},{"$f":"IF(C19=\"\",\"\",C19)","v":"exemple : sit niv1"},{"$f":"IF(D19=\"\",\"\",D19)","v":""},{"$f":"IF(E19=\"\",\"\",E19)","v":""},{"$f":"IF(F19=\"\",\"\",F19)","v":""},{"$f":"IF(G19=\"\",\"\",G19)","v":""},{"$f":"IF(H19=\"\",\"\",H19)","v":""},{"$f":"IF(I19=\"\",\"\",I19)","v":""}]
[null,"     Prenez le temps de compléter les différents champs    *Seules les cellules blanches sont modifiables",null,null,null,null,null,null,null,{"$f":"E57","v":12},null,"Quel enjeu ?",null,{"$f":"8-COUNTBLANK(B8:I8)","v":3},null,{"$f":"IF(B8<>\"\",B6,\"\")","v":"Axe 1 "},"Axe 2","Axe 3","","","","","",{"$f":"COUNTBLANK(P4:W4)","v":5},null,"exemple : sit niv2","exemple : sit niv2","","","","","",""]
[null,"Ci-dessous vous avez pouvoir définir vos axes et bien plus !!",null,null,null,null,null,null,null,null,null,"Moteur ",null,null,null,{"$f":"IF(P4=B6,B8,\"\")","v":"Le serveur "},"Observateur","?","","","","","",{"$f":"8-X4","v":3},null,"sit3","sit3","","","","","",""]
[null,"Axe 1 ","Axe 2","Axe 3","Axe 4","Axe 5","Axe 6","Axe 7","Axe 8",null,null,"Non moteur",null,null,null,{"$f":"IF(P4=B6,B10,\"\")","v":"Moteur "},{"$f":"IF(Q4=C6,C10,\"\")","v":"Non moteur"},{"$f":"IF(R4=D6,D10,\"\")","v":"Quel enjeu ?"},{"$f":"IF(S4=E6,E10,\"\")","v":""},{"$f":"IF(T4=F6,F10,\"\")","v":""},{"$f":"IF(U4=G6,G10,\"\")","v":""},{"$f":"IF(V4=H6,H10,\"\")","v":""},{"$f":"IF(W4=I6,I10,\"\")","v":""},null,null,"sit4","sit4","","","","","",""]
[null,"Définir vos axes de travail par un texte ci-dessous (jusqu'à 8 axes possibles, seuls ceux complétés apparaîtront)",null,null,null,null,null,null,null,null,null,null,null,null,null,{"$f":"IF(P4=B6,B12,\"\")","v":"Le sablier"},0,0,"","","","","",null,null,"sit5","sit5","","","","","",""]
[null,"Le serveur ","Observateur","?",null,null,null,null,null,null,null,null,null,{"$f":"N4","v":3},null,null,null,null,null,null,null,null,null,null,null,"","","","","","","",""]
[null,"Quelle est la nature de l'enjeu de chacun des axes de travail définis ? (liste de choix ci-dessous) ",null,null,null,null,null,null,null,null,null,"Nombre d'indications",null,null,null,null,null,null,null,null,null,null,null,null,null,"","","","","","","",""]
[null,"Moteur ","Non moteur","Quel enjeu ?","Quel enjeu ?","Quel enjeu ?","Quel enjeu ?","Quel enjeu ?","Quel enjeu ?",null,null,"Nombre de leçon ",null,null,null,null,null,null,null,null,null,null,null,null,null,"","","","","","","",""]
[null,"Décrire ci-dessous la situation de référence pour un enjeu moteur OU le rôle social si l'enjeu est non moteur ",null,null,null,null,null,null,null,null,null,null,null,null,null,null,null,null,null,null,null,null,null,null,null,"","","","","","","",""]
[null,"Le sablier",null,null,null,null,null,null,null,null,null,null,null,null,null,null,null,null,null,null,null,null,null,null,null,"",{"$f":"IF(C28=\"\",\"\",C28)","v":""},{"$f":"IF(D28=\"\",\"\",D28)","v":""},{"$f":"IF(E28=\"\",\"\",E28)","v":""},{"$f":"IF(F28=\"\",\"\",F28)","v":""},{"$f":"IF(G28=\"\",\"\",G28)","v":""},{"$f":"IF(H28=\"\",\"\",H28)","v":""},{"$f":"IF(I28=\"\",\"\",I28)","v":""}]
[null," Nommer ci-dessous les critères, echelles descriptives (de 1 à 4 possibles) liés à cet enjeu ",null,null,null,null,null,null,null,null,null,null,null,null,null,null,null,null,null,null,null,null,null,null,null,"",{"$f":"IF(C29=\"\",\"\",C29)","v":""},{"$f":"IF(D29=\"\",\"\",D29)","v":""},{"$f":"IF(E29=\"\",\"\",E29)","v":""},{"$f":"IF(F29=\"\",\"\",F29)","v":""},{"$f":"IF(G29=\"\",\"\",G29)","v":""},{"$f":"IF(H29=\"\",\"\",H29)","v":""},{"$f":"IF(I29=\"\",\"\",I29)","v":""}]
[null,"9 points",null,null,null,null,null,null,null,null,null,null,null,null,null,null,null,null,null,null,null,null,null,null,null,"","","","","","","",""]
[null,"99 points",null,null,null,null,null,null,null,null,null,null,"Résultats situations liste déroulante ",null,null,null,null,null,null,null,null,null,null,null,null,"","","","","","","",""]
[null,"999 pts ",null,null,null,null,null,null,null,null,null,null,null,null,null,null,null,null,null,null,null,null,null,null,null,"","","","","","","",""]
[null,"9999 pts",null,null,null,null,null,null,null,null,null,null,0,null,null,null,null,null,null,null,null,null,null,null,null,"","",{"$f":"IF(D33=\"\",\"\",D33)","v":""},{"$f":"IF(E33=\"\",\"\",E33)","v":""},{"$f":"IF(F33=\"\",\"\",F33)","v":""},{"$f":"IF(G33=\"\",\"\",G33)","v":""},{"$f":"IF(H33=\"\",\"\",H33)","v":""},{"$f":"IF(I33=\"\",\"\",I33)","v":""}]
[null," Nommer ci-dessous vos situations d'apprentissage (rangées du haut vers le bas par difficultés croissantes)",null,null,null,null,null,null,null,null,null,null,1,null,null,null,null,null,null,null,null,null,null,null,null,null,""]
[null,{"$f":"\"exemple : sit niv1\"","v":"exemple : sit niv1"},"exemple : sit niv1",null,null,null,null,null,null,null,null,null,2,null,null,null,null,null,null,null,null,null,null,null,null,null,""]
[null,{"$f":"\"exemple : sit niv2\"","v":"exemple : sit niv2"},"exemple : sit niv2",null,null,null,null,null,null,null,null,null,3]
[null,"sit3","sit3",null,null,null,null,null,null,null,null,null,4]
[null,"sit4","sit4"]
[null,"sit5","sit5"]
[]
[]
[]
[]
[]
[]
[]
[]
[]
[]
[]
[]
[]
[]
[]
[]
[]
[]
[]
[]
[]
[]
[]
[]
[]
[null,"Ci-dessous vous pouvez modifier l'APSA, certains termes et le nom du graphique"]
[null,"Nom du graphique \"Radar\"",null,"Définition",null,"Situations d'apprentissage",null,"Critères rappel >"]
[null,"Progrès ",null,"Enjeu",null,"Résultats ",null,"Je me situe >"]
[null,null,null,"Sit de Réf",null,"Je me projette",null,"Mon Projet pour L"]
[null,"APSA",null,"Rôle",null,"Enjeu de travail principal de cette leçon >",null,"Mon Axe Pioritaire en L"]
[null,"Rappel",null,"Axes de Travail ",null,"Enjeu de travail secondaire de cette leçon >",null,"Mes progrès"]
[]
[null,"Dernière étape avant la création de vos fiches élèves de suivi de séquence"]
[null,"Combien de leçons prévoyez-vous sur la séquence ?     (12 maximum)",null,null,12,"Ci-dessous le bouton qui va créer vos fiches en fonction de vos choix.                Un conseil : enregistrez votre travail avant d'appuyer sur celui-ci !                 Cette sauvegarde pourra vous servir pour un autre groupe une autre classe"]
[null,"Vous êtes prêt ?",null,null,null,null,null,"Soyez patient ! "]
[null," Alors, lisez bien les deux phrases ci-dessous et appuyez sur le bouton >>>",null,null,null,null,null,"Il faut compter 2 à 3 secondes par élève soit moins d'une minute pour une classe de 25 élèves ..."]
[null,">  Pour finaliser votre application, il ne vous restera qu'à appuyer sur le bouton \"Concevoir/Déployer\" présent en haut à droite de chacune des fiches élèves, à enregistrer votre travail puis à transférer l'application sur vos tablettes y compris via Nextcloud (Nuage de Apps éducation). "]
[null,">  Ce deuxième bouton \"Concevoir / Déployer\" vous permettra depuis un ordinateur de faire quelques ajustements mais vous ne pourrez plus modifier la structure de votre application (nombre d' élèves, nombres d'axes de travail, nombres de leçons etc …)"]

{"sheet":"Entrée","index":3,"n_rows":2,"n_cols":2,"rows_kept":2,"cut":false,"hidden":false,"merged":[[0,0,0,8]]}
["Entrée "]
[null,"Elève 1"]

{"sheet":"Synthèse","index":4,"n_rows":41,"n_cols":67,"rows_kept":41,"cut":false,"hidden":false,"merged":[[3,47,3,50],[3,51,3,54],[1,1,3,2],[3,5,3,6],[3,23,3,26],[3,27,3,30],[3,11,3,12],[3,9,3,10],[3,7,3,8],[3,3,3,4],[2,19,2,66],[3,55,3,58],[3,59,3,62],[3,63,3,66],[3,17,3,18],[3,15,3,16],[2,3,2,18],[3,19,3,22],[3,35,3,38],[3,39,3,42],[3,43,3,46],[3,13,3,14],[3,31,3,34]]}
[null,"Prof","Prof"]
[null,"Synthèse"]
[null,null,null,"Il se voit ... alors qu'il est …",null,null,null,null,null,null,null,null,null,null,null,null,null,null,null,"                           Ce qu'il fait !"]
[null,null,null,"Axe 1",null,"Axe 2 ",null,"Axe 3",null,"Axe 4",null,"Axe 5",null,"Axe 6",null,"Axe 7",null,"Axe 8",null,"L1",null,null,null,"L2",null,null,null,"L3",null,null,null,"L4",null,null,null,"L5",null,null,null,"L6",null,null,null,"L7",null,null,null,"L8",null,null,null,"L9",null,null,null,"L10",null,null,null,"L11",null,null,null,"L12"]
[null,"Codes","Noms Prénoms","Elève ","Prof","Elève ","Prof","Elève ","Prof","Elève ","Prof","Elève ","Prof","Elève ","Prof","Elève ","Prof","Elève ","Prof","Enjeu 1er","Enjeu 2nd","Nbre Sit","L+","Enjeu 1er","Enjeu 2nd","Nbre Sit","L+","Enjeu 1er","Enjeu 2nd","Nbre Sit","L+","Enjeu 1er","Enjeu 2nd","Nbre Sit","L+","Enjeu 1er","Enjeu 2nd","Nbre Sit","L+","Enjeu 1er","Enjeu 2nd","Nbre Sit","L+","Enjeu 1er","Enjeu 2nd","Nbre Sit","L+","Enjeu 1er","Enjeu 2nd","Nbre Sit","L+","Enjeu 1er","Enjeu 2nd","Nbre Sit","L+","Enjeu 1er","Enjeu 2nd","Nbre Sit","L+","Enjeu 1er","Enjeu 2nd","Nbre Sit","L+","Enjeu 1er","Enjeu 2nd","Nbre Sit","L+"]
[null,555,{"$f":"Parametres!Q3","v":"Elève 1"},{"$f":"Feuil1!AI6","v":0},null,{"$f":"Feuil1!AJ6","v":0},null,{"$f":"Feuil1!AK6","v":0},null,{"$f":"Feuil1!AL6","v":0},null,{"$f":"Feuil1!AM6","v":0},null,{"$f":"Feuil1!AN6","v":0},null,{"$f":"Feuil1!AO6","v":0},null,{"$f":"Feuil1!AP6","v":0},null,{"$f":"Feuil1!$AS35","v":""},{"$f":"Feuil1!$AS36","v":""},{"$f":"10-COUNTIF(Feuil1!$AG25:$AG34,\"\")","v":0},{"$f":"Feuil1!$AO37","v":""},{"$f":"Feuil1!$AS55","v":""},{"$f":"Feuil1!$AS56","v":""},{"$f":"10-COUNTIF(Feuil1!$AG45:$AG54,\"\")","v":0},{"$f":"Feuil1!$AO57","v":""},{"$f":"Feuil1!$AS75","v":""},{"$f":"Feuil1!$AS76","v":""},{"$f":"10-COUNTIF(Feuil1!$AG65:$AG74,\"\")","v":0},{"$f":"Feuil1!$AO77","v":""},{"$f":"Feuil1!$AS95","v":""},{"$f":"Feuil1!$AS96","v":""},{"$f":"10-COUNTIF(Feuil1!$AG85:$AG94,\"\")","v":0},{"$f":"Feuil1!$AO97","v":""},{"$f":"Feuil1!$AS115","v":""},{"$f":"Feuil1!$AS116","v":""},{"$f":"10-COUNTIF(Feuil1!$AG105:$AG114,\"\")","v":0},{"$f":"Feuil1!$AO117","v":""},{"$f":"Feuil1!$AS135","v":""},{"$f":"Feuil1!$AS136","v":""},{"$f":"10-COUNTIF(Feuil1!$AG125:$AG134,\"\")","v":0},{"$f":"Feuil1!$AO137","v":""},{"$f":"Feuil1!$AS155","v":""},{"$f":"Feuil1!$AS156","v":""},{"$f":"10-COUNTIF(Feuil1!$AG145:$AG154,\"\")","v":0},{"$f":"Feuil1!$AO157","v":""},{"$f":"Feuil1!$AS175","v":""},{"$f":"Feuil1!$AS176","v":""},{"$f":"10-COUNTIF(Feuil1!$AG165:$AG174,\"\")","v":0},{"$f":"Feuil1!$AO177","v":""},{"$f":"Feuil1!$AS195","v":""},{"$f":"Feuil1!$AS196","v":""},{"$f":"10-COUNTIF(Feuil1!$AG185:$AG194,\"\")","v":0},{"$f":"Feuil1!$AO197","v":0},{"$f":"Feuil1!$AS215","v":""},{"$f":"Feuil1!$AS216","v":""},{"$f":"10-COUNTIF(Feuil1!$AG205:$AG214,\"\")","v":0},{"$f":"Feuil1!$AO217","v":0},{"$f":"Feuil1!$AS235","v":""},{"$f":"Feuil1!$AS236","v":""},{"$f":"10-COUNTIF(Feuil1!$AG225:$AG234,\"\")","v":0},{"$f":"Feuil1!$AO237","v":0},{"$f":"Feuil1!$AS255","v":""},{"$f":"Feuil1!$AS256","v":""},{"$f":"10-COUNTIF(Feuil1!$AG245:$AG254,\"\")","v":0},{"$f":"Feuil1!$AO257","v":0}]
[null,222,{"$f":"Parametres!Q4","v":""},{"$f":"#REF!","v":{"$error":"#REF!"}},null,{"$f":"#REF!","v":{"$error":"#REF!"}},null,{"$f":"#REF!","v":{"$error":"#REF!"}},null,{"$f":"#REF!","v":{"$error":"#REF!"}},null,{"$f":"#REF!","v":{"$error":"#REF!"}},null,{"$f":"#REF!","v":{"$error":"#REF!"}},null,{"$f":"#REF!","v":{"$error":"#REF!"}},null,{"$f":"#REF!","v":{"$error":"#REF!"}},null,{"$f":"#REF!","v":{"$error":"#REF!"}},{"$f":"#REF!","v":{"$error":"#REF!"}},{"$f":"10-COUNTIF(#REF!,\"\")","v":{"$error":"#REF!"}},{"$f":"#REF!","v":{"$error":"#REF!"}},{"$f":"#REF!","v":{"$error":"#REF!"}},{"$f":"#REF!","v":{"$error":"#REF!"}},{"$f":"10-COUNTIF(#REF!,\"\")","v":{"$error":"#REF!"}},{"$f":"#REF!","v":{"$error":"#REF!"}},{"$f":"#REF!","v":{"$error":"#REF!"}},{"$f":"#REF!","v":{"$error":"#REF!"}},{"$f":"10-COUNTIF(#REF!,\"\")","v":{"$error":"#REF!"}},{"$f":"#REF!","v":{"$error":"#REF!"}},{"$f":"#REF!","v":{"$error":"#REF!"}},{"$f":"#REF!","v":{"$error":"#REF!"}},{"$f":"10-COUNTIF(#REF!,\"\")","v":{"$error":"#REF!"}},{"$f":"#REF!","v":{"$error":"#REF!"}},{"$f":"#REF!","v":{"$error":"#REF!"}},{"$f":"#REF!","v":{"$error":"#REF!"}},{"$f":"10-COUNTIF(#REF!,\"\")","v":{"$error":"#REF!"}},{"$f":"#REF!","v":{"$error":"#REF!"}},{"$f":"#REF!","v":{"$error":"#REF!"}},{"$f":"#REF!","v":{"$error":"#REF!"}},{"$f":"10-COUNTIF(#REF!,\"\")","v":{"$error":"#REF!"}},{"$f":"#REF!","v":{"$error":"#REF!"}},{"$f":"#REF!","v":{"$error":"#REF!"}},{"$f":"#REF!","v":{"$error":"#REF!"}},{"$f":"10-COUNTIF(#REF!,\"\")","v":{"$error":"#REF!"}},{"$f":"#REF!","v":{"$error":"#REF!"}},{"$f":"#REF!","v":{"$error":"#REF!"}},{"$f":"#REF!","v":{"$error":"#REF!"}},{"$f":"10-COUNTIF(#REF!,\"\")","v":{"$error":"#REF!"}},{"$f":"#REF!","v":{"$error":"#REF!"}},{"$f":"#REF!","v":{"$error":"#REF!"}},{"$f":"#REF!","v":{"$error":"#REF!"}},{"$f":"10-COUNTIF(#REF!,\"\")","v":{"$error":"#REF!"}},{"$f":"#REF!","v":{"$error":"#REF!"}},{"$f":"#REF!","v":{"$error":"#REF!"}},{"$f":"#REF!","v":{"$error":"#REF!"}},{"$f":"10-COUNTIF(#REF!,\"\")","v":{"$error":"#REF!"}},{"$f":"#REF!","v":{"$error":"#REF!"}},{"$f":"#REF!","v":{"$error":"#REF!"}},{"$f":"#REF!","v":{"$error":"#REF!"}},{"$f":"10-COUNTIF(#REF!,\"\")","v":{"$error":"#REF!"}},{"$f":"#REF!","v":{"$error":"#REF!"}},{"$f":"#REF!","v":{"$error":"#REF!"}},{"$f":"#REF!","v":{"$error":"#REF!"}},{"$f":"10-COUNTIF(#REF!,\"\")","v":{"$error":"#REF!"}},{"$f":"#REF!","v":{"$error":"#REF!"}}]
[null,185,{"$f":"Parametres!Q5","v":""},{"$f":"#REF!","v":{"$error":"#REF!"}},null,{"$f":"#REF!","v":{"$error":"#REF!"}},null,{"$f":"#REF!","v":{"$error":"#REF!"}},null,{"$f":"#REF!","v":{"$error":"#REF!"}},null,{"$f":"#REF!","v":{"$error":"#REF!"}},null,{"$f":"#REF!","v":{"$error":"#REF!"}},null,{"$f":"#REF!","v":{"$error":"#REF!"}},null,{"$f":"#REF!","v":{"$error":"#REF!"}},null,{"$f":"#REF!","v":{"$error":"#REF!"}},{"$f":"#REF!","v":{"$error":"#REF!"}},{"$f":"10-COUNTIF(#REF!,\"\")","v":{"$error":"#REF!"}},{"$f":"#REF!","v":{"$error":"#REF!"}},{"$f":"#REF!","v":{"$error":"#REF!"}},{"$f":"#REF!","v":{"$error":"#REF!"}},{"$f":"10-COUNTIF(#REF!,\"\")","v":{"$error":"#REF!"}},{"$f":"#REF!","v":{"$error":"#REF!"}},{"$f":"#REF!","v":{"$error":"#REF!"}},{"$f":"#REF!","v":{"$error":"#REF!"}},{"$f":"10-COUNTIF(#REF!,\"\")","v":{"$error":"#REF!"}},{"$f":"#REF!","v":{"$error":"#REF!"}},{"$f":"#REF!","v":{"$error":"#REF!"}},{"$f":"#REF!","v":{"$error":"#REF!"}},{"$f":"10-COUNTIF(#REF!,\"\")","v":{"$error":"#REF!"}},{"$f":"#REF!","v":{"$error":"#REF!"}},{"$f":"#REF!","v":{"$error":"#REF!"}},{"$f":"#REF!","v":{"$error":"#REF!"}},{"$f":"10-COUNTIF(#REF!,\"\")","v":{"$error":"#REF!"}},{"$f":"#REF!","v":{"$error":"#REF!"}},{"$f":"#REF!","v":{"$error":"#REF!"}},{"$f":"#REF!","v":{"$error":"#REF!"}},{"$f":"10-COUNTIF(#REF!,\"\")","v":{"$error":"#REF!"}},{"$f":"#REF!","v":{"$error":"#REF!"}},{"$f":"#REF!","v":{"$error":"#REF!"}},{"$f":"#REF!","v":{"$error":"#REF!"}},{"$f":"10-COUNTIF(#REF!,\"\")","v":{"$error":"#REF!"}},{"$f":"#REF!","v":{"$error":"#REF!"}},{"$f":"#REF!","v":{"$error":"#REF!"}},{"$f":"#REF!","v":{"$error":"#REF!"}},{"$f":"10-COUNTIF(#REF!,\"\")","v":{"$error":"#REF!"}},{"$f":"#REF!","v":{"$error":"#REF!"}},{"$f":"#REF!","v":{"$error":"#REF!"}},{"$f":"#REF!","v":{"$error":"#REF!"}},{"$f":"10-COUNTIF(#REF!,\"\")","v":{"$error":"#REF!"}},{"$f":"#REF!","v":{"$error":"#REF!"}},{"$f":"#REF!","v":{"$error":"#REF!"}},{"$f":"#REF!","v":{"$error":"#REF!"}},{"$f":"10-COUNTIF(#REF!,\"\")","v":{"$error":"#REF!"}},{"$f":"#REF!","v":{"$error":"#REF!"}},{"$f":"#REF!","v":{"$error":"#REF!"}},{"$f":"#REF!","v":{"$error":"#REF!"}},{"$f":"10-COUNTIF(#REF!,\"\")","v":{"$error":"#REF!"}},{"$f":"#REF!","v":{"$error":"#REF!"}},{"$f":"#REF!","v":{"$error":"#REF!"}},{"$f":"#REF!","v":{"$error":"#REF!"}},{"$f":"10-COUNTIF(#REF!,\"\")","v":{"$error":"#REF!"}},{"$f":"#REF!","v":{"$error":"#REF!"}}]
[null,216,{"$f":"Parametres!Q6","v":""},{"$f":"#REF!","v":{"$error":"#REF!"}},null,{"$f":"#REF!","v":{"$error":"#REF!"}},null,{"$f":"#REF!","v":{"$error":"#REF!"}},null,{"$f":"#REF!","v":{"$error":"#REF!"}},null,{"$f":"#REF!","v":{"$error":"#REF!"}},null,{"$f":"#REF!","v":{"$error":"#REF!"}},null,{"$f":"#REF!","v":{"$error":"#REF!"}},null,{"$f":"#REF!","v":{"$error":"#REF!"}},null,{"$f":"#REF!","v":{"$error":"#REF!"}},{"$f":"#REF!","v":{"$error":"#REF!"}},{"$f":"10-COUNTIF(#REF!,\"\")","v":{"$error":"#REF!"}},{"$f":"#REF!","v":{"$error":"#REF!"}},{"$f":"#REF!","v":{"$error":"#REF!"}},{"$f":"#REF!","v":{"$error":"#REF!"}},{"$f":"10-COUNTIF(#REF!,\"\")","v":{"$error":"#REF!"}},{"$f":"#REF!","v":{"$error":"#REF!"}},{"$f":"#REF!","v":{"$error":"#REF!"}},{"$f":"#REF!","v":{"$error":"#REF!"}},{"$f":"10-COUNTIF(#REF!,\"\")","v":{"$error":"#REF!"}},{"$f":"#REF!","v":{"$error":"#REF!"}},{"$f":"#REF!","v":{"$error":"#REF!"}},{"$f":"#REF!","v":{"$error":"#REF!"}},{"$f":"10-COUNTIF(#REF!,\"\")","v":{"$error":"#REF!"}},{"$f":"#REF!","v":{"$error":"#REF!"}},{"$f":"#REF!","v":{"$error":"#REF!"}},{"$f":"#REF!","v":{"$error":"#REF!"}},{"$f":"10-COUNTIF(#REF!,\"\")","v":{"$error":"#REF!"}},{"$f":"#REF!","v":{"$error":"#REF!"}},{"$f":"#REF!","v":{"$error":"#REF!"}},{"$f":"#REF!","v":{"$error":"#REF!"}},{"$f":"10-COUNTIF(#REF!,\"\")","v":{"$error":"#REF!"}},{"$f":"#REF!","v":{"$error":"#REF!"}},{"$f":"#REF!","v":{"$error":"#REF!"}},{"$f":"#REF!","v":{"$error":"#REF!"}},{"$f":"10-COUNTIF(#REF!,\"\")","v":{"$error":"#REF!"}},{"$f":"#REF!","v":{"$error":"#REF!"}},{"$f":"#REF!","v":{"$error":"#REF!"}},{"$f":"#REF!","v":{"$error":"#REF!"}},{"$f":"10-COUNTIF(#REF!,\"\")","v":{"$error":"#REF!"}},{"$f":"#REF!","v":{"$error":"#REF!"}},{"$f":"#REF!","v":{"$error":"#REF!"}},{"$f":"#REF!","v":{"$error":"#REF!"}},{"$f":"10-COUNTIF(#REF!,\"\")","v":{"$error":"#REF!"}},{"$f":"#REF!","v":{"$error":"#REF!"}},{"$f":"#REF!","v":{"$error":"#REF!"}},{"$f":"#REF!","v":{"$error":"#REF!"}},{"$f":"10-COUNTIF(#REF!,\"\")","v":{"$error":"#REF!"}},{"$f":"#REF!","v":{"$error":"#REF!"}},{"$f":"#REF!","v":{"$error":"#REF!"}},{"$f":"#REF!","v":{"$error":"#REF!"}},{"$f":"10-COUNTIF(#REF!,\"\")","v":{"$error":"#REF!"}},{"$f":"#REF!","v":{"$error":"#REF!"}},{"$f":"#REF!","v":{"$error":"#REF!"}},{"$f":"#REF!","v":{"$error":"#REF!"}},{"$f":"10-COUNTIF(#REF!,\"\")","v":{"$error":"#REF!"}},{"$f":"#REF!","v":{"$error":"#REF!"}}]
[null,247,{"$f":"Parametres!Q7","v":""},{"$f":"#REF!","v":{"$error":"#REF!"}},null,{"$f":"#REF!","v":{"$error":"#REF!"}},null,{"$f":"#REF!","v":{"$error":"#REF!"}},null,{"$f":"#REF!","v":{"$error":"#REF!"}},null,{"$f":"#REF!","v":{"$error":"#REF!"}},null,{"$f":"#REF!","v":{"$error":"#REF!"}},null,{"$f":"#REF!","v":{"$error":"#REF!"}},null,{"$f":"#REF!","v":{"$error":"#REF!"}},null,{"$f":"#REF!","v":{"$error":"#REF!"}},{"$f":"#REF!","v":{"$error":"#REF!"}},{"$f":"10-COUNTIF(#REF!,\"\")","v":{"$error":"#REF!"}},{"$f":"#REF!","v":{"$error":"#REF!"}},{"$f":"#REF!","v":{"$error":"#REF!"}},{"$f":"#REF!","v":{"$error":"#REF!"}},{"$f":"10-COUNTIF(#REF!,\"\")","v":{"$error":"#REF!"}},{"$f":"#REF!","v":{"$error":"#REF!"}},{"$f":"#REF!","v":{"$error":"#REF!"}},{"$f":"#REF!","v":{"$error":"#REF!"}},{"$f":"10-COUNTIF(#REF!,\"\")","v":{"$error":"#REF!"}},{"$f":"#REF!","v":{"$error":"#REF!"}},{"$f":"#REF!","v":{"$error":"#REF!"}},{"$f":"#REF!","v":{"$error":"#REF!"}},{"$f":"10-COUNTIF(#REF!,\"\")","v":{"$error":"#REF!"}},{"$f":"#REF!","v":{"$error":"#REF!"}},{"$f":"#REF!","v":{"$error":"#REF!"}},{"$f":"#REF!","v":{"$error":"#REF!"}},{"$f":"10-COUNTIF(#REF!,\"\")","v":{"$error":"#REF!"}},{"$f":"#REF!","v":{"$error":"#REF!"}},{"$f":"#REF!","v":{"$error":"#REF!"}},{"$f":"#REF!","v":{"$error":"#REF!"}},{"$f":"10-COUNTIF(#REF!,\"\")","v":{"$error":"#REF!"}},{"$f":"#REF!","v":{"$error":"#REF!"}},{"$f":"#REF!","v":{"$error":"#REF!"}},{"$f":"#REF!","v":{"$error":"#REF!"}},{"$f":"10-COUNTIF(#REF!,\"\")","v":{"$error":"#REF!"}},{"$f":"#REF!","v":{"$error":"#REF!"}},{"$f":"#REF!","v":{"$error":"#REF!"}},{"$f":"#REF!","v":{"$error":"#REF!"}},{"$f":"10-COUNTIF(#REF!,\"\")","v":{"$error":"#REF!"}},{"$f":"#REF!","v":{"$error":"#REF!"}},{"$f":"#REF!","v":{"$error":"#REF!"}},{"$f":"#REF!","v":{"$error":"#REF!"}},{"$f":"10-COUNTIF(#REF!,\"\")","v":{"$error":"#REF!"}},{"$f":"#REF!","v":{"$error":"#REF!"}},{"$f":"#REF!","v":{"$error":"#REF!"}},{"$f":"#REF!","v":{"$error":"#REF!"}},{"$f":"10-COUNTIF(#REF!,\"\")","v":{"$error":"#REF!"}},{"$f":"#REF!","v":{"$error":"#REF!"}},{"$f":"#REF!","v":{"$error":"#REF!"}},{"$f":"#REF!","v":{"$error":"#REF!"}},{"$f":"10-COUNTIF(#REF!,\"\")","v":{"$error":"#REF!"}},{"$f":"#REF!","v":{"$error":"#REF!"}},{"$f":"#REF!","v":{"$error":"#REF!"}},{"$f":"#REF!","v":{"$error":"#REF!"}},{"$f":"10-COUNTIF(#REF!,\"\")","v":{"$error":"#REF!"}},{"$f":"#REF!","v":{"$error":"#REF!"}}]
[null,278,{"$f":"Parametres!Q8","v":""},{"$f":"#REF!","v":{"$error":"#REF!"}},null,{"$f":"#REF!","v":{"$error":"#REF!"}},null,{"$f":"#REF!","v":{"$error":"#REF!"}},null,{"$f":"#REF!","v":{"$error":"#REF!"}},null,{"$f":"#REF!","v":{"$error":"#REF!"}},null,{"$f":"#REF!","v":{"$error":"#REF!"}},null,{"$f":"#REF!","v":{"$error":"#REF!"}},null,{"$f":"#REF!","v":{"$error":"#REF!"}},null,{"$f":"#REF!","v":{"$error":"#REF!"}},{"$f":"#REF!","v":{"$error":"#REF!"}},{"$f":"10-COUNTIF(#REF!,\"\")","v":{"$error":"#REF!"}},{"$f":"#REF!","v":{"$error":"#REF!"}},{"$f":"#REF!","v":{"$error":"#REF!"}},{"$f":"#REF!","v":{"$error":"#REF!"}},{"$f":"10-COUNTIF(#REF!,\"\")","v":{"$error":"#REF!"}},{"$f":"#REF!","v":{"$error":"#REF!"}},{"$f":"#REF!","v":{"$error":"#REF!"}},{"$f":"#REF!","v":{"$error":"#REF!"}},{"$f":"10-COUNTIF(#REF!,\"\")","v":{"$error":"#REF!"}},{"$f":"#REF!","v":{"$error":"#REF!"}},{"$f":"#REF!","v":{"$error":"#REF!"}},{"$f":"#REF!","v":{"$error":"#REF!"}},{"$f":"10-COUNTIF(#REF!,\"\")","v":{"$error":"#REF!"}},{"$f":"#REF!","v":{"$error":"#REF!"}},{"$f":"#REF!","v":{"$error":"#REF!"}},{"$f":"#REF!","v":{"$error":"#REF!"}},{"$f":"10-COUNTIF(#REF!,\"\")","v":{"$error":"#REF!"}},{"$f":"#REF!","v":{"$error":"#REF!"}},{"$f":"#REF!","v":{"$error":"#REF!"}},{"$f":"#REF!","v":{"$error":"#REF!"}},{"$f":"10-COUNTIF(#REF!,\"\")","v":{"$error":"#REF!"}},{"$f":"#REF!","v":{"$error":"#REF!"}},{"$f":"#REF!","v":{"$error":"#REF!"}},{"$f":"#REF!","v":{"$error":"#REF!"}},{"$f":"10-COUNTIF(#REF!,\"\")","v":{"$error":"#REF!"}},{"$f":"#REF!","v":{"$error":"#REF!"}},{"$f":"#REF!","v":{"$error":"#REF!"}},{"$f":"#REF!","v":{"$error":"#REF!"}},{"$f":"10-COUNTIF(#REF!,\"\")","v":{"$error":"#REF!"}},{"$f":"#REF!","v":{"$error":"#REF!"}},{"$f":"#REF!","v":{"$error":"#REF!"}},{"$f":"#REF!","v":{"$error":"#REF!"}},{"$f":"10-COUNTIF(#REF!,\"\")","v":{"$error":"#REF!"}},{"$f":"#REF!","v":{"$error":"#REF!"}},{"$f":"#REF!","v":{"$error":"#REF!"}},{"$f":"#REF!","v":{"$error":"#REF!"}},{"$f":"10-COUNTIF(#REF!,\"\")","v":{"$error":"#REF!"}},{"$f":"#REF!","v":{"$error":"#REF!"}},{"$f":"#REF!","v":{"$error":"#REF!"}},{"$f":"#REF!","v":{"$error":"#REF!"}},{"$f":"10-COUNTIF(#REF!,\"\")","v":{"$error":"#REF!"}},{"$f":"#REF!","v":{"$error":"#REF!"}},{"$f":"#REF!","v":{"$error":"#REF!"}},{"$f":"#REF!","v":{"$error":"#REF!"}},{"$f":"10-COUNTIF(#REF!,\"\")","v":{"$error":"#REF!"}},{"$f":"#REF!","v":{"$error":"#REF!"}}]
[null,309,{"$f":"Parametres!Q9","v":""},{"$f":"#REF!","v":{"$error":"#REF!"}},null,{"$f":"#REF!","v":{"$error":"#REF!"}},null,{"$f":"#REF!","v":{"$error":"#REF!"}},null,{"$f":"#REF!","v":{"$error":"#REF!"}},null,{"$f":"#REF!","v":{"$error":"#REF!"}},null,{"$f":"#REF!","v":{"$error":"#REF!"}},null,{"$f":"#REF!","v":{"$error":"#REF!"}},null,{"$f":"#REF!","v":{"$error":"#REF!"}},null,{"$f":"#REF!","v":{"$error":"#REF!"}},{"$f":"#REF!","v":{"$error":"#REF!"}},{"$f":"10-COUNTIF(#REF!,\"\")","v":{"$error":"#REF!"}},{"$f":"#REF!","v":{"$error":"#REF!"}},{"$f":"#REF!","v":{"$error":"#REF!"}},{"$f":"#REF!","v":{"$error":"#REF!"}},{"$f":"10-COUNTIF(#REF!,\"\")","v":{"$error":"#REF!"}},{"$f":"#REF!","v":{"$error":"#REF!"}},{"$f":"#REF!","v":{"$error":"#REF!"}},{"$f":"#REF!","v":{"$error":"#REF!"}},{"$f":"10-COUNTIF(#REF!,\"\")","v":{"$error":"#REF!"}},{"$f":"#REF!","v":{"$error":"#REF!"}},{"$f":"#REF!","v":{"$error":"#REF!"}},{"$f":"#REF!","v":{"$error":"#REF!"}},{"$f":"10-COUNTIF(#REF!,\"\")","v":{"$error":"#REF!"}},{"$f":"#REF!","v":{"$error":"#REF!"}},{"$f":"#REF!","v":{"$error":"#REF!"}},{"$f":"#REF!","v":{"$error":"#REF!"}},{"$f":"10-COUNTIF(#REF!,\"\")","v":{"$error":"#REF!"}},{"$f":"#REF!","v":{"$error":"#REF!"}},{"$f":"#REF!","v":{"$error":"#REF!"}},{"$f":"#REF!","v":{"$error":"#REF!"}},{"$f":"10-COUNTIF(#REF!,\"\")","v":{"$error":"#REF!"}},{"$f":"#REF!","v":{"$error":"#REF!"}},{"$f":"#REF!","v":{"$error":"#REF!"}},{"$f":"#REF!","v":{"$error":"#REF!"}},{"$f":"10-COUNTIF(#REF!,\"\")","v":{"$error":"#REF!"}},{"$f":"#REF!","v":{"$error":"#REF!"}},{"$f":"#REF!","v":{"$error":"#REF!"}},{"$f":"#REF!","v":{"$error":"#REF!"}},{"$f":"10-COUNTIF(#REF!,\"\")","v":{"$error":"#REF!"}},{"$f":"#REF!","v":{"$error":"#REF!"}},{"$f":"#REF!","v":{"$error":"#REF!"}},{"$f":"#REF!","v":{"$error":"#REF!"}},{"$f":"10-COUNTIF(#REF!,\"\")","v":{"$error":"#REF!"}},{"$f":"#REF!","v":{"$error":"#REF!"}},{"$f":"#REF!","v":{"$error":"#REF!"}},{"$f":"#REF!","v":{"$error":"#REF!"}},{"$f":"10-COUNTIF(#REF!,\"\")","v":{"$error":"#REF!"}},{"$f":"#REF!","v":{"$error":"#REF!"}},{"$f":"#REF!","v":{"$error":"#REF!"}},{"$f":"#REF!","v":{"$error":"#REF!"}},{"$f":"10-COUNTIF(#REF!,\"\")","v":{"$error":"#REF!"}},{"$f":"#REF!","v":{"$error":"#REF!"}},{"$f":"#REF!","v":{"$error":"#REF!"}},{"$f":"#REF!","v":{"$error":"#REF!"}},{"$f":"10-COUNTIF(#REF!,\"\")","v":{"$error":"#REF!"}},{"$f":"#REF!","v":{"$error":"#REF!"}}]
[null,340,{"$f":"Parametres!Q10","v":""},{"$f":"#REF!","v":{"$error":"#REF!"}},null,{"$f":"#REF!","v":{"$error":"#REF!"}},null,{"$f":"#REF!","v":{"$error":"#REF!"}},null,{"$f":"#REF!","v":{"$error":"#REF!"}},null,{"$f":"#REF!","v":{"$error":"#REF!"}},null,{"$f":"#REF!","v":{"$error":"#REF!"}},null,{"$f":"#REF!","v":{"$error":"#REF!"}},null,{"$f":"#REF!","v":{"$error":"#REF!"}},null,{"$f":"#REF!","v":{"$error":"#REF!"}},{"$f":"#REF!","v":{"$error":"#REF!"}},{"$f":"10-COUNTIF(#REF!,\"\")","v":{"$error":"#REF!"}},{"$f":"#REF!","v":{"$error":"#REF!"}},{"$f":"#REF!","v":{"$error":"#REF!"}},{"$f":"#REF!","v":{"$error":"#REF!"}},{"$f":"10-COUNTIF(#REF!,\"\")","v":{"$error":"#REF!"}},{"$f":"#REF!","v":{"$error":"#REF!"}},{"$f":"#REF!","v":{"$error":"#REF!"}},{"$f":"#REF!","v":{"$error":"#REF!"}},{"$f":"10-COUNTIF(#REF!,\"\")","v":{"$error":"#REF!"}},{"$f":"#REF!","v":{"$error":"#REF!"}},{"$f":"#REF!","v":{"$error":"#REF!"}},{"$f":"#REF!","v":{"$error":"#REF!"}},{"$f":"10-COUNTIF(#REF!,\"\")","v":{"$error":"#REF!"}},{"$f":"#REF!","v":{"$error":"#REF!"}},{"$f":"#REF!","v":{"$error":"#REF!"}},{"$f":"#REF!","v":{"$error":"#REF!"}},{"$f":"10-COUNTIF(#REF!,\"\")","v":{"$error":"#REF!"}},{"$f":"#REF!","v":{"$error":"#REF!"}},{"$f":"#REF!","v":{"$error":"#REF!"}},{"$f":"#REF!","v":{"$error":"#REF!"}},{"$f":"10-COUNTIF(#REF!,\"\")","v":{"$error":"#REF!"}},{"$f":"#REF!","v":{"$error":"#REF!"}},{"$f":"#REF!","v":{"$error":"#REF!"}},{"$f":"#REF!","v":{"$error":"#REF!"}},{"$f":"10-COUNTIF(#REF!,\"\")","v":{"$error":"#REF!"}},{"$f":"#REF!","v":{"$error":"#REF!"}},{"$f":"#REF!","v":{"$error":"#REF!"}},{"$f":"#REF!","v":{"$error":"#REF!"}},{"$f":"10-COUNTIF(#REF!,\"\")","v":{"$error":"#REF!"}},{"$f":"#REF!","v":{"$error":"#REF!"}},{"$f":"#REF!","v":{"$error":"#REF!"}},{"$f":"#REF!","v":{"$error":"#REF!"}},{"$f":"10-COUNTIF(#REF!,\"\")","v":{"$error":"#REF!"}},{"$f":"#REF!","v":{"$error":"#REF!"}},{"$f":"#REF!","v":{"$error":"#REF!"}},{"$f":"#REF!","v":{"$error":"#REF!"}},{"$f":"10-COUNTIF(#REF!,\"\")","v":{"$error":"#REF!"}},{"$f":"#REF!","v":{"$error":"#REF!"}},{"$f":"#REF!","v":{"$error":"#REF!"}},{"$f":"#REF!","v":{"$error":"#REF!"}},{"$f":"10-COUNTIF(#REF!,\"\")","v":{"$error":"#REF!"}},{"$f":"#REF!","v":{"$error":"#REF!"}},{"$f":"#REF!","v":{"$error":"#REF!"}},{"$f":"#REF!","v":{"$error":"#REF!"}},{"$f":"10-COUNTIF(#REF!,\"\")","v":{"$error":"#REF!"}},{"$f":"#REF!","v":{"$error":"#REF!"}}]
[null,371,{"$f":"Parametres!Q11","v":""},{"$f":"#REF!","v":{"$error":"#REF!"}},null,{"$f":"#REF!","v":{"$error":"#REF!"}},null,{"$f":"#REF!","v":{"$error":"#REF!"}},null,{"$f":"#REF!","v":{"$error":"#REF!"}},null,{"$f":"#REF!","v":{"$error":"#REF!"}},null,{"$f":"#REF!","v":{"$error":"#REF!"}},null,{"$f":"#REF!","v":{"$error":"#REF!"}},null,{"$f":"#REF!","v":{"$error":"#REF!"}},null,{"$f":"#REF!","v":{"$error":"#REF!"}},{"$f":"#REF!","v":{"$error":"#REF!"}},{"$f":"10-COUNTIF(#REF!,\"\")","v":{"$error":"#REF!"}},{"$f":"#REF!","v":{"$error":"#REF!"}},{"$f":"#REF!","v":{"$error":"#REF!"}},{"$f":"#REF!","v":{"$error":"#REF!"}},{"$f":"10-COUNTIF(#REF!,\"\")","v":{"$error":"#REF!"}},{"$f":"#REF!","v":{"$error":"#REF!"}},{"$f":"#REF!","v":{"$error":"#REF!"}},{"$f":"#REF!","v":{"$error":"#REF!"}},{"$f":"10-COUNTIF(#REF!,\"\")","v":{"$error":"#REF!"}},{"$f":"#REF!","v":{"$error":"#REF!"}},{"$f":"#REF!","v":{"$error":"#REF!"}},{"$f":"#REF!","v":{"$error":"#REF!"}},{"$f":"10-COUNTIF(#REF!,\"\")","v":{"$error":"#REF!"}},{"$f":"#REF!","v":{"$error":"#REF!"}},{"$f":"#REF!","v":{"$error":"#REF!"}},{"$f":"#REF!","v":{"$error":"#REF!"}},{"$f":"10-COUNTIF(#REF!,\"\")","v":{"$error":"#REF!"}},{"$f":"#REF!","v":{"$error":"#REF!"}},{"$f":"#REF!","v":{"$error":"#REF!"}},{"$f":"#REF!","v":{"$error":"#REF!"}},{"$f":"10-COUNTIF(#REF!,\"\")","v":{"$error":"#REF!"}},{"$f":"#REF!","v":{"$error":"#REF!"}},{"$f":"#REF!","v":{"$error":"#REF!"}},{"$f":"#REF!","v":{"$error":"#REF!"}},{"$f":"10-COUNTIF(#REF!,\"\")","v":{"$error":"#REF!"}},{"$f":"#REF!","v":{"$error":"#REF!"}},{"$f":"#REF!","v":{"$error":"#REF!"}},{"$f":"#REF!","v":{"$error":"#REF!"}},{"$f":"10-COUNTIF(#REF!,\"\")","v":{"$error":"#REF!"}},{"$f":"#REF!","v":{"$error":"#REF!"}},{"$f":"#REF!","v":{"$error":"#REF!"}},{"$f":"#REF!","v":{"$error":"#REF!"}},{"$f":"10-COUNTIF(#REF!,\"\")","v":{"$error":"#REF!"}},{"$f":"#REF!","v":{"$error":"#REF!"}},{"$f":"#REF!","v":{"$error":"#REF!"}},{"$f":"#REF!","v":{"$error":"#REF!"}},{"$f":"10-COUNTIF(#REF!,\"\")","v":{"$error":"#REF!"}},{"$f":"#REF!","v":{"$error":"#REF!"}},{"$f":"#REF!","v":{"$error":"#REF!"}},{"$f":"#REF!","v":{"$error":"#REF!"}},{"$f":"10-COUNTIF(#REF!,\"\")","v":{"$error":"#REF!"}},{"$f":"#REF!","v":{"$error":"#REF!"}},{"$f":"#REF!","v":{"$error":"#REF!"}},{"$f":"#REF!","v":{"$error":"#REF!"}},{"$f":"10-COUNTIF(#REF!,\"\")","v":{"$error":"#REF!"}},{"$f":"#REF!","v":{"$error":"#REF!"}}]
[null,402,{"$f":"Parametres!Q12","v":""},{"$f":"#REF!","v":{"$error":"#REF!"}},null,{"$f":"#REF!","v":{"$error":"#REF!"}},null,{"$f":"#REF!","v":{"$error":"#REF!"}},null,{"$f":"#REF!","v":{"$error":"#REF!"}},null,{"$f":"#REF!","v":{"$error":"#REF!"}},null,{"$f":"#REF!","v":{"$error":"#REF!"}},null,{"$f":"#REF!","v":{"$error":"#REF!"}},null,{"$f":"#REF!","v":{"$error":"#REF!"}},null,{"$f":"#REF!","v":{"$error":"#REF!"}},{"$f":"#REF!","v":{"$error":"#REF!"}},{"$f":"10-COUNTIF(#REF!,\"\")","v":{"$error":"#REF!"}},{"$f":"#REF!","v":{"$error":"#REF!"}},{"$f":"#REF!","v":{"$error":"#REF!"}},{"$f":"#REF!","v":{"$error":"#REF!"}},{"$f":"10-COUNTIF(#REF!,\"\")","v":{"$error":"#REF!"}},{"$f":"#REF!","v":{"$error":"#REF!"}},{"$f":"#REF!","v":{"$error":"#REF!"}},{"$f":"#REF!","v":{"$error":"#REF!"}},{"$f":"10-COUNTIF(#REF!,\"\")","v":{"$error":"#REF!"}},{"$f":"#REF!","v":{"$error":"#REF!"}},{"$f":"#REF!","v":{"$error":"#REF!"}},{"$f":"#REF!","v":{"$error":"#REF!"}},{"$f":"10-COUNTIF(#REF!,\"\")","v":{"$error":"#REF!"}},{"$f":"#REF!","v":{"$error":"#REF!"}},{"$f":"#REF!","v":{"$error":"#REF!"}},{"$f":"#REF!","v":{"$error":"#REF!"}},{"$f":"10-COUNTIF(#REF!,\"\")","v":{"$error":"#REF!"}},{"$f":"#REF!","v":{"$error":"#REF!"}},{"$f":"#REF!","v":{"$error":"#REF!"}},{"$f":"#REF!","v":{"$error":"#REF!"}},{"$f":"10-COUNTIF(#REF!,\"\")","v":{"$error":"#REF!"}},{"$f":"#REF!","v":{"$error":"#REF!"}},{"$f":"#REF!","v":{"$error":"#REF!"}},{"$f":"#REF!","v":{"$error":"#REF!"}},{"$f":"10-COUNTIF(#REF!,\"\")","v":{"$error":"#REF!"}},{"$f":"#REF!","v":{"$error":"#REF!"}},{"$f":"#REF!","v":{"$error":"#REF!"}},{"$f":"#REF!","v":{"$error":"#REF!"}},{"$f":"10-COUNTIF(#REF!,\"\")","v":{"$error":"#REF!"}},{"$f":"#REF!","v":{"$error":"#REF!"}},{"$f":"#REF!","v":{"$error":"#REF!"}},{"$f":"#REF!","v":{"$error":"#REF!"}},{"$f":"10-COUNTIF(#REF!,\"\")","v":{"$error":"#REF!"}},{"$f":"#REF!","v":{"$error":"#REF!"}},{"$f":"#REF!","v":{"$error":"#REF!"}},{"$f":"#REF!","v":{"$error":"#REF!"}},{"$f":"10-COUNTIF(#REF!,\"\")","v":{"$error":"#REF!"}},{"$f":"#REF!","v":{"$error":"#REF!"}},{"$f":"#REF!","v":{"$error":"#REF!"}},{"$f":"#REF!","v":{"$error":"#REF!"}},{"$f":"10-COUNTIF(#REF!,\"\")","v":{"$error":"#REF!"}},{"$f":"#REF!","v":{"$error":"#REF!"}},{"$f":"#REF!","v":{"$error":"#REF!"}},{"$f":"#REF!","v":{"$error":"#REF!"}},{"$f":"10-COUNTIF(#REF!,\"\")","v":{"$error":"#REF!"}},{"$f":"#REF!","v":{"$error":"#REF!"}}]
[null,433,{"$f":"Parametres!Q13","v":""},{"$f":"#REF!","v":{"$error":"#REF!"}},null,{"$f":"#REF!","v":{"$error":"#REF!"}},null,{"$f":"#REF!","v":{"$error":"#REF!"}},null,{"$f":"#REF!","v":{"$error":"#REF!"}},null,{"$f":"#REF!","v":{"$error":"#REF!"}},null,{"$f":"#REF!","v":{"$error":"#REF!"}},null,{"$f":"#REF!","v":{"$error":"#REF!"}},null,{"$f":"#REF!","v":{"$error":"#REF!"}},null,{"$f":"#REF!","v":{"$error":"#REF!"}},{"$f":"#REF!","v":{"$error":"#REF!"}},{"$f":"10-COUNTIF(#REF!,\"\")","v":{"$error":"#REF!"}},{"$f":"#REF!","v":{"$error":"#REF!"}},{"$f":"#REF!","v":{"$error":"#REF!"}},{"$f":"#REF!","v":{"$error":"#REF!"}},{"$f":"10-COUNTIF(#REF!,\"\")","v":{"$error":"#REF!"}},{"$f":"#REF!","v":{"$error":"#REF!"}},{"$f":"#REF!","v":{"$error":"#REF!"}},{"$f":"#REF!","v":{"$error":"#REF!"}},{"$f":"10-COUNTIF(#REF!,\"\")","v":{"$error":"#REF!"}},{"$f":"#REF!","v":{"$error":"#REF!"}},{"$f":"#REF!","v":{"$error":"#REF!"}},{"$f":"#REF!","v":{"$error":"#REF!"}},{"$f":"10-COUNTIF(#REF!,\"\")","v":{"$error":"#REF!"}},{"$f":"#REF!","v":{"$error":"#REF!"}},{"$f":"#REF!","v":{"$error":"#REF!"}},{"$f":"#REF!","v":{"$error":"#REF!"}},{"$f":"10-COUNTIF(#REF!,\"\")","v":{"$error":"#REF!"}},{"$f":"#REF!","v":{"$error":"#REF!"}},{"$f":"#REF!","v":{"$error":"#REF!"}},{"$f":"#REF!","v":{"$error":"#REF!"}},{"$f":"10-COUNTIF(#REF!,\"\")","v":{"$error":"#REF!"}},{"$f":"#REF!","v":{"$error":"#REF!"}},{"$f":"#REF!","v":{"$error":"#REF!"}},{"$f":"#REF!","v":{"$error":"#REF!"}},{"$f":"10-COUNTIF(#REF!,\"\")","v":{"$error":"#REF!"}},{"$f":"#REF!","v":{"$error":"#REF!"}},{"$f":"#REF!","v":{"$error":"#REF!"}},{"$f":"#REF!","v":{"$error":"#REF!"}},{"$f":"10-COUNTIF(#REF!,\"\")","v":{"$error":"#REF!"}},{"$f":"#REF!","v":{"$error":"#REF!"}},{"$f":"#REF!","v":{"$error":"#REF!"}},{"$f":"#REF!","v":{"$error":"#REF!"}},{"$f":"10-COUNTIF(#REF!,\"\")","v":{"$error":"#REF!"}},{"$f":"#REF!","v":{"$error":"#REF!"}},{"$f":"#REF!","v":{"$error":"#REF!"}},{"$f":"#REF!","v":{"$error":"#REF!"}},{"$f":"10-COUNTIF(#REF!,\"\")","v":{"$error":"#REF!"}},{"$f":"#REF!","v":{"$error":"#REF!"}},{"$f":"#REF!","v":{"$error":"#REF!"}},{"$f":"#REF!","v":{"$error":"#REF!"}},{"$f":"10-COUNTIF(#REF!,\"\")","v":{"$error":"#REF!"}},{"$f":"#REF!","v":{"$error":"#REF!"}},{"$f":"#REF!","v":{"$error":"#REF!"}},{"$f":"#REF!","v":{"$error":"#REF!"}},{"$f":"10-COUNTIF(#REF!,\"\")","v":{"$error":"#REF!"}},{"$f":"#REF!","v":{"$error":"#REF!"}}]
[null,464,{"$f":"Parametres!Q14","v":""},{"$f":"#REF!","v":{"$error":"#REF!"}},null,{"$f":"#REF!","v":{"$error":"#REF!"}},null,{"$f":"#REF!","v":{"$error":"#REF!"}},null,{"$f":"#REF!","v":{"$error":"#REF!"}},null,{"$f":"#REF!","v":{"$error":"#REF!"}},null,{"$f":"#REF!","v":{"$error":"#REF!"}},null,{"$f":"#REF!","v":{"$error":"#REF!"}},null,{"$f":"#REF!","v":{"$error":"#REF!"}},null,{"$f":"#REF!","v":{"$error":"#REF!"}},{"$f":"#REF!","v":{"$error":"#REF!"}},{"$f":"10-COUNTIF(#REF!,\"\")","v":{"$error":"#REF!"}},{"$f":"#REF!","v":{"$error":"#REF!"}},{"$f":"#REF!","v":{"$error":"#REF!"}},{"$f":"#REF!","v":{"$error":"#REF!"}},{"$f":"10-COUNTIF(#REF!,\"\")","v":{"$error":"#REF!"}},{"$f":"#REF!","v":{"$error":"#REF!"}},{"$f":"#REF!","v":{"$error":"#REF!"}},{"$f":"#REF!","v":{"$error":"#REF!"}},{"$f":"10-COUNTIF(#REF!,\"\")","v":{"$error":"#REF!"}},{"$f":"#REF!","v":{"$error":"#REF!"}},{"$f":"#REF!","v":{"$error":"#REF!"}},{"$f":"#REF!","v":{"$error":"#REF!"}},{"$f":"10-COUNTIF(#REF!,\"\")","v":{"$error":"#REF!"}},{"$f":"#REF!","v":{"$error":"#REF!"}},{"$f":"#REF!","v":{"$error":"#REF!"}},{"$f":"#REF!","v":{"$error":"#REF!"}},{"$f":"10-COUNTIF(#REF!,\"\")","v":{"$error":"#REF!"}},{"$f":"#REF!","v":{"$error":"#REF!"}},{"$f":"#REF!","v":{"$error":"#REF!"}},{"$f":"#REF!","v":{"$error":"#REF!"}},{"$f":"10-COUNTIF(#REF!,\"\")","v":{"$error":"#REF!"}},{"$f":"#REF!","v":{"$error":"#REF!"}},{"$f":"#REF!","v":{"$error":"#REF!"}},{"$f":"#REF!","v":{"$error":"#REF!"}},{"$f":"10-COUNTIF(#REF!,\"\")","v":{"$error":"#REF!"}},{"$f":"#REF!","v":{"$error":"#REF!"}},{"$f":"#REF!","v":{"$error":"#REF!"}},{"$f":"#REF!","v":{"$error":"#REF!"}},{"$f":"10-COUNTIF(#REF!,\"\")","v":{"$error":"#REF!"}},{"$f":"#REF!","v":{"$error":"#REF!"}},{"$f":"#REF!","v":{"$error":"#REF!"}},{"$f":"#REF!","v":{"$error":"#REF!"}},{"$f":"10-COUNTIF(#REF!,\"\")","v":{"$error":"#REF!"}},{"$f":"#REF!","v":{"$error":"#REF!"}},{"$f":"#REF!","v":{"$error":"#REF!"}},{"$f":"#REF!","v":{"$error":"#REF!"}},{"$f":"10-COUNTIF(#REF!,\"\")","v":{"$error":"#REF!"}},{"$f":"#REF!","v":{"$error":"#REF!"}},{"$f":"#REF!","v":{"$error":"#REF!"}},{"$f":"#REF!","v":{"$error":"#REF!"}},{"$f":"10-COUNTIF(#REF!,\"\")","v":{"$error":"#REF!"}},{"$f":"#REF!","v":{"$error":"#REF!"}},{"$f":"#REF!","v":{"$error":"#REF!"}},{"$f":"#REF!","v":{"$error":"#REF!"}},{"$f":"10-COUNTIF(#REF!,\"\")","v":{"$error":"#REF!"}},{"$f":"#REF!","v":{"$error":"#REF!"}}]
[null,495,{"$f":"Parametres!Q15","v":""},{"$f":"#REF!","v":{"$error":"#REF!"}},null,{"$f":"#REF!","v":{"$error":"#REF!"}},null,{"$f":"#REF!","v":{"$error":"#REF!"}},null,{"$f":"#REF!","v":{"$error":"#REF!"}},null,{"$f":"#REF!","v":{"$error":"#REF!"}},null,{"$f":"#REF!","v":{"$error":"#REF!"}},null,{"$f":"#REF!","v":{"$error":"#REF!"}},null,{"$f":"#REF!","v":{"$error":"#REF!"}},null,{"$f":"#REF!","v":{"$error":"#REF!"}},{"$f":"#REF!","v":{"$error":"#REF!"}},{"$f":"10-COUNTIF(#REF!,\"\")","v":{"$error":"#REF!"}},{"$f":"#REF!","v":{"$error":"#REF!"}},{"$f":"#REF!","v":{"$error":"#REF!"}},{"$f":"#REF!","v":{"$error":"#REF!"}},{"$f":"10-COUNTIF(#REF!,\"\")","v":{"$error":"#REF!"}},{"$f":"#REF!","v":{"$error":"#REF!"}},{"$f":"#REF!","v":{"$error":"#REF!"}},{"$f":"#REF!","v":{"$error":"#REF!"}},{"$f":"10-COUNTIF(#REF!,\"\")","v":{"$error":"#REF!"}},{"$f":"#REF!","v":{"$error":"#REF!"}},{"$f":"#REF!","v":{"$error":"#REF!"}},{"$f":"#REF!","v":{"$error":"#REF!"}},{"$f":"10-COUNTIF(#REF!,\"\")","v":{"$error":"#REF!"}},{"$f":"#REF!","v":{"$error":"#REF!"}},{"$f":"#REF!","v":{"$error":"#REF!"}},{"$f":"#REF!","v":{"$error":"#REF!"}},{"$f":"10-COUNTIF(#REF!,\"\")","v":{"$error":"#REF!"}},{"$f":"#REF!","v":{"$error":"#REF!"}},{"$f":"#REF!","v":{"$error":"#REF!"}},{"$f":"#REF!","v":{"$error":"#REF!"}},{"$f":"10-COUNTIF(#REF!,\"\")","v":{"$error":"#REF!"}},{"$f":"#REF!","v":{"$error":"#REF!"}},{"$f":"#REF!","v":{"$error":"#REF!"}},{"$f":"#REF!","v":{"$error":"#REF!"}},{"$f":"10-COUNTIF(#REF!,\"\")","v":{"$error":"#REF!"}},{"$f":"#REF!","v":{"$error":"#REF!"}},{"$f":"#REF!","v":{"$error":"#REF!"}},{"$f":"#REF!","v":{"$error":"#REF!"}},{"$f":"10-COUNTIF(#REF!,\"\")","v":{"$error":"#REF!"}},{"$f":"#REF!","v":{"$error":"#REF!"}},{"$f":"#REF!","v":{"$error":"#REF!"}},{"$f":"#REF!","v":{"$error":"#REF!"}},{"$f":"10-COUNTIF(#REF!,\"\")","v":{"$error":"#REF!"}},{"$f":"#REF!","v":{"$error":"#REF!"}},{"$f":"#REF!","v":{"$error":"#REF!"}},{"$f":"#REF!","v":{"$error":"#REF!"}},{"$f":"10-COUNTIF(#REF!,\"\")","v":{"$error":"#REF!"}},{"$f":"#REF!","v":{"$error":"#REF!"}},{"$f":"#REF!","v":{"$error":"#REF!"}},{"$f":"#REF!","v":{"$error":"#REF!"}},{"$f":"10-COUNTIF(#REF!,\"\")","v":{"$error":"#REF!"}},{"$f":"#REF!","v":{"$error":"#REF!"}},{"$f":"#REF!","v":{"$error":"#REF!"}},{"$f":"#REF!","v":{"$error":"#REF!"}},{"$f":"10-COUNTIF(#REF!,\"\")","v":{"$error":"#REF!"}},{"$f":"#REF!","v":{"$error":"#REF!"}}]
[null,526,{"$f":"Parametres!Q16","v":""},{"$f":"#REF!","v":{"$error":"#REF!"}},null,{"$f":"#REF!","v":{"$error":"#REF!"}},null,{"$f":"#REF!","v":{"$error":"#REF!"}},null,{"$f":"#REF!","v":{"$error":"#REF!"}},null,{"$f":"#REF!","v":{"$error":"#REF!"}},null,{"$f":"#REF!","v":{"$error":"#REF!"}},null,{"$f":"#REF!","v":{"$error":"#REF!"}},null,{"$f":"#REF!","v":{"$error":"#REF!"}},null,{"$f":"#REF!","v":{"$error":"#REF!"}},{"$f":"#REF!","v":{"$error":"#REF!"}},{"$f":"10-COUNTIF(#REF!,\"\")","v":{"$error":"#REF!"}},{"$f":"#REF!","v":{"$error":"#REF!"}},{"$f":"#REF!","v":{"$error":"#REF!"}},{"$f":"#REF!","v":{"$error":"#REF!"}},{"$f":"10-COUNTIF(#REF!,\"\")","v":{"$error":"#REF!"}},{"$f":"#REF!","v":{"$error":"#REF!"}},{"$f":"#REF!","v":{"$error":"#REF!"}},{"$f":"#REF!","v":{"$error":"#REF!"}},{"$f":"10-COUNTIF(#REF!,\"\")","v":{"$error":"#REF!"}},{"$f":"#REF!","v":{"$error":"#REF!"}},{"$f":"#REF!","v":{"$error":"#REF!"}},{"$f":"#REF!","v":{"$error":"#REF!"}},{"$f":"10-COUNTIF(#REF!,\"\")","v":{"$error":"#REF!"}},{"$f":"#REF!","v":{"$error":"#REF!"}},{"$f":"#REF!","v":{"$error":"#REF!"}},{"$f":"#REF!","v":{"$error":"#REF!"}},{"$f":"10-COUNTIF(#REF!,\"\")","v":{"$error":"#REF!"}},{"$f":"#REF!","v":{"$error":"#REF!"}},{"$f":"#REF!","v":{"$error":"#REF!"}},{"$f":"#REF!","v":{"$error":"#REF!"}},{"$f":"10-COUNTIF(#REF!,\"\")","v":{"$error":"#REF!"}},{"$f":"#REF!","v":{"$error":"#REF!"}},{"$f":"#REF!","v":{"$error":"#REF!"}},{"$f":"#REF!","v":{"$error":"#REF!"}},{"$f":"10-COUNTIF(#REF!,\"\")","v":{"$error":"#REF!"}},{"$f":"#REF!","v":{"$error":"#REF!"}},{"$f":"#REF!","v":{"$error":"#REF!"}},{"$f":"#REF!","v":{"$error":"#REF!"}},{"$f":"10-COUNTIF(#REF!,\"\")","v":{"$error":"#REF!"}},{"$f":"#REF!","v":{"$error":"#REF!"}},{"$f":"#REF!","v":{"$error":"#REF!"}},{"$f":"#REF!","v":{"$error":"#REF!"}},{"$f":"10-COUNTIF(#REF!,\"\")","v":{"$error":"#REF!"}},{"$f":"#REF!","v":{"$error":"#REF!"}},{"$f":"#REF!","v":{"$error":"#REF!"}},{"$f":"#REF!","v":{"$error":"#REF!"}},{"$f":"10-COUNTIF(#REF!,\"\")","v":{"$error":"#REF!"}},{"$f":"#REF!","v":{"$error":"#REF!"}},{"$f":"#REF!","v":{"$error":"#REF!"}},{"$f":"#REF!","v":{"$error":"#REF!"}},{"$f":"10-COUNTIF(#REF!,\"\")","v":{"$error":"#REF!"}},{"$f":"#REF!","v":{"$error":"#REF!"}},{"$f":"#REF!","v":{"$error":"#REF!"}},{"$f":"#REF!","v":{"$error":"#REF!"}},{"$f":"10-COUNTIF(#REF!,\"\")","v":{"$error":"#REF!"}},{"$f":"#REF!","v":{"$error":"#REF!"}}]
[null,557,{"$f":"Parametres!Q17","v":""},{"$f":"#REF!","v":{"$error":"#REF!"}},null,{"$f":"#REF!","v":{"$error":"#REF!"}},null,{"$f":"#REF!","v":{"$error":"#REF!"}},null,{"$f":"#REF!","v":{"$error":"#REF!"}},null,{"$f":"#REF!","v":{"$error":"#REF!"}},null,{"$f":"#REF!","v":{"$error":"#REF!"}},null,{"$f":"#REF!","v":{"$error":"#REF!"}},null,{"$f":"#REF!","v":{"$error":"#REF!"}},null,{"$f":"#REF!","v":{"$error":"#REF!"}},{"$f":"#REF!","v":{"$error":"#REF!"}},{"$f":"10-COUNTIF(#REF!,\"\")","v":{"$error":"#REF!"}},{"$f":"#REF!","v":{"$error":"#REF!"}},{"$f":"#REF!","v":{"$error":"#REF!"}},{"$f":"#REF!","v":{"$error":"#REF!"}},{"$f":"10-COUNTIF(#REF!,\"\")","v":{"$error":"#REF!"}},{"$f":"#REF!","v":{"$error":"#REF!"}},{"$f":"#REF!","v":{"$error":"#REF!"}},{"$f":"#REF!","v":{"$error":"#REF!"}},{"$f":"10-COUNTIF(#REF!,\"\")","v":{"$error":"#REF!"}},{"$f":"#REF!","v":{"$error":"#REF!"}},{"$f":"#REF!","v":{"$error":"#REF!"}},{"$f":"#REF!","v":{"$error":"#REF!"}},{"$f":"10-COUNTIF(#REF!,\"\")","v":{"$error":"#REF!"}},{"$f":"#REF!","v":{"$error":"#REF!"}},{"$f":"#REF!","v":{"$error":"#REF!"}},{"$f":"#REF!","v":{"$error":"#REF!"}},{"$f":"10-COUNTIF(#REF!,\"\")","v":{"$error":"#REF!"}},{"$f":"#REF!","v":{"$error":"#REF!"}},{"$f":"#REF!","v":{"$error":"#REF!"}},{"$f":"#REF!","v":{"$error":"#REF!"}},{"$f":"10-COUNTIF(#REF!,\"\")","v":{"$error":"#REF!"}},{"$f":"#REF!","v":{"$error":"#REF!"}},{"$f":"#REF!","v":{"$error":"#REF!"}},{"$f":"#REF!","v":{"$error":"#REF!"}},{"$f":"10-COUNTIF(#REF!,\"\")","v":{"$error":"#REF!"}},{"$f":"#REF!","v":{"$error":"#REF!"}},{"$f":"#REF!","v":{"$error":"#REF!"}},{"$f":"#REF!","v":{"$error":"#REF!"}},{"$f":"10-COUNTIF(#REF!,\"\")","v":{"$error":"#REF!"}},{"$f":"#REF!","v":{"$error":"#REF!"}},{"$f":"#REF!","v":{"$error":"#REF!"}},{"$f":"#REF!","v":{"$error":"#REF!"}},{"$f":"10-COUNTIF(#REF!,\"\")","v":{"$error":"#REF!"}},{"$f":"#REF!","v":{"$error":"#REF!"}},{"$f":"#REF!","v":{"$error":"#REF!"}},{"$f":"#REF!","v":{"$error":"#REF!"}},{"$f":"10-COUNTIF(#REF!,\"\")","v":{"$error":"#REF!"}},{"$f":"#REF!","v":{"$error":"#REF!"}},{"$f":"#REF!","v":{"$error":"#REF!"}},{"$f":"#REF!","v":{"$error":"#REF!"}},{"$f":"10-COUNTIF(#REF!,\"\")","v":{"$error":"#REF!"}},{"$f":"#REF!","v":{"$error":"#REF!"}},{"$f":"#REF!","v":{"$error":"#REF!"}},{"$f":"#REF!","v":{"$error":"#REF!"}},{"$f":"10-COUNTIF(#REF!,\"\")","v":{"$error":"#REF!"}},{"$f":"#REF!","v":{"$error":"#REF!"}}]
[null,588,{"$f":"Parametres!Q18","v":""},{"$f":"#REF!","v":{"$error":"#REF!"}},null,{"$f":"#REF!","v":{"$error":"#REF!"}},null,{"$f":"#REF!","v":{"$error":"#REF!"}},null,{"$f":"#REF!","v":{"$error":"#REF!"}},null,{"$f":"#REF!","v":{"$error":"#REF!"}},null,{"$f":"#REF!","v":{"$error":"#REF!"}},null,{"$f":"#REF!","v":{"$error":"#REF!"}},null,{"$f":"#REF!","v":{"$error":"#REF!"}},null,{"$f":"#REF!","v":{"$error":"#REF!"}},{"$f":"#REF!","v":{"$error":"#REF!"}},{"$f":"10-COUNTIF(#REF!,\"\")","v":{"$error":"#REF!"}},{"$f":"#REF!","v":{"$error":"#REF!"}},{"$f":"#REF!","v":{"$error":"#REF!"}},{"$f":"#REF!","v":{"$error":"#REF!"}},{"$f":"10-COUNTIF(#REF!,\"\")","v":{"$error":"#REF!"}},{"$f":"#REF!","v":{"$error":"#REF!"}},{"$f":"#REF!","v":{"$error":"#REF!"}},{"$f":"#REF!","v":{"$error":"#REF!"}},{"$f":"10-COUNTIF(#REF!,\"\")","v":{"$error":"#REF!"}},{"$f":"#REF!","v":{"$error":"#REF!"}},{"$f":"#REF!","v":{"$error":"#REF!"}},{"$f":"#REF!","v":{"$error":"#REF!"}},{"$f":"10-COUNTIF(#REF!,\"\")","v":{"$error":"#REF!"}},{"$f":"#REF!","v":{"$error":"#REF!"}},{"$f":"#REF!","v":{"$error":"#REF!"}},{"$f":"#REF!","v":{"$error":"#REF!"}},{"$f":"10-COUNTIF(#REF!,\"\")","v":{"$error":"#REF!"}},{"$f":"#REF!","v":{"$error":"#REF!"}},{"$f":"#REF!","v":{"$error":"#REF!"}},{"$f":"#REF!","v":{"$error":"#REF!"}},{"$f":"10-COUNTIF(#REF!,\"\")","v":{"$error":"#REF!"}},{"$f":"#REF!","v":{"$error":"#REF!"}},{"$f":"#REF!","v":{"$error":"#REF!"}},{"$f":"#REF!","v":{"$error":"#REF!"}},{"$f":"10-COUNTIF(#REF!,\"\")","v":{"$error":"#REF!"}},{"$f":"#REF!","v":{"$error":"#REF!"}},{"$f":"#REF!","v":{"$error":"#REF!"}},{"$f":"#REF!","v":{"$error":"#REF!"}},{"$f":"10-COUNTIF(#REF!,\"\")","v":{"$error":"#REF!"}},{"$f":"#REF!","v":{"$error":"#REF!"}},{"$f":"#REF!","v":{"$error":"#REF!"}},{"$f":"#REF!","v":{"$error":"#REF!"}},{"$f":"10-COUNTIF(#REF!,\"\")","v":{"$error":"#REF!"}},{"$f":"#REF!","v":{"$error":"#REF!"}},{"$f":"#REF!","v":{"$error":"#REF!"}},{"$f":"#REF!","v":{"$error":"#REF!"}},{"$f":"10-COUNTIF(#REF!,\"\")","v":{"$error":"#REF!"}},{"$f":"#REF!","v":{"$error":"#REF!"}},{"$f":"#REF!","v":{"$error":"#REF!"}},{"$f":"#REF!","v":{"$error":"#REF!"}},{"$f":"10-COUNTIF(#REF!,\"\")","v":{"$error":"#REF!"}},{"$f":"#REF!","v":{"$error":"#REF!"}},{"$f":"#REF!","v":{"$error":"#REF!"}},{"$f":"#REF!","v":{"$error":"#REF!"}},{"$f":"10-COUNTIF(#REF!,\"\")","v":{"$error":"#REF!"}},{"$f":"#REF!","v":{"$error":"#REF!"}}]
[null,619,{"$f":"Parametres!Q19","v":""},{"$f":"#REF!","v":{"$error":"#REF!"}},null,{"$f":"#REF!","v":{"$error":"#REF!"}},null,{"$f":"#REF!","v":{"$error":"#REF!"}},null,{"$f":"#REF!","v":{"$error":"#REF!"}},null,{"$f":"#REF!","v":{"$error":"#REF!"}},null,{"$f":"#REF!","v":{"$error":"#REF!"}},null,{"$f":"#REF!","v":{"$error":"#REF!"}},null,{"$f":"#REF!","v":{"$error":"#REF!"}},null,{"$f":"#REF!","v":{"$error":"#REF!"}},{"$f":"#REF!","v":{"$error":"#REF!"}},{"$f":"10-COUNTIF(#REF!,\"\")","v":{"$error":"#REF!"}},{"$f":"#REF!","v":{"$error":"#REF!"}},{"$f":"#REF!","v":{"$error":"#REF!"}},{"$f":"#REF!","v":{"$error":"#REF!"}},{"$f":"10-COUNTIF(#REF!,\"\")","v":{"$error":"#REF!"}},{"$f":"#REF!","v":{"$error":"#REF!"}},{"$f":"#REF!","v":{"$error":"#REF!"}},{"$f":"#REF!","v":{"$error":"#REF!"}},{"$f":"10-COUNTIF(#REF!,\"\")","v":{"$error":"#REF!"}},{"$f":"#REF!","v":{"$error":"#REF!"}},{"$f":"#REF!","v":{"$error":"#REF!"}},{"$f":"#REF!","v":{"$error":"#REF!"}},{"$f":"10-COUNTIF(#REF!,\"\")","v":{"$error":"#REF!"}},{"$f":"#REF!","v":{"$error":"#REF!"}},{"$f":"#REF!","v":{"$error":"#REF!"}},{"$f":"#REF!","v":{"$error":"#REF!"}},{"$f":"10-COUNTIF(#REF!,\"\")","v":{"$error":"#REF!"}},{"$f":"#REF!","v":{"$error":"#REF!"}},{"$f":"#REF!","v":{"$error":"#REF!"}},{"$f":"#REF!","v":{"$error":"#REF!"}},{"$f":"10-COUNTIF(#REF!,\"\")","v":{"$error":"#REF!"}},{"$f":"#REF!","v":{"$error":"#REF!"}},{"$f":"#REF!","v":{"$error":"#REF!"}},{"$f":"#REF!","v":{"$error":"#REF!"}},{"$f":"10-COUNTIF(#REF!,\"\")","v":{"$error":"#REF!"}},{"$f":"#REF!","v":{"$error":"#REF!"}},{"$f":"#REF!","v":{"$error":"#REF!"}},{"$f":"#REF!","v":{"$error":"#REF!"}},{"$f":"10-COUNTIF(#REF!,\"\")","v":{"$error":"#REF!"}},{"$f":"#REF!","v":{"$error":"#REF!"}},{"$f":"#REF!","v":{"$error":"#REF!"}},{"$f":"#REF!","v":{"$error":"#REF!"}},{"$f":"10-COUNTIF(#REF!,\"\")","v":{"$error":"#REF!"}},{"$f":"#REF!","v":{"$error":"#REF!"}},{"$f":"#REF!","v":{"$error":"#REF!"}},{"$f":"#REF!","v":{"$error":"#REF!"}},{"$f":"10-COUNTIF(#REF!,\"\")","v":{"$error":"#REF!"}},{"$f":"#REF!","v":{"$error":"#REF!"}},{"$f":"#REF!","v":{"$error":"#REF!"}},{"$f":"#REF!","v":{"$error":"#REF!"}},{"$f":"10-COUNTIF(#REF!,\"\")","v":{"$error":"#REF!"}},{"$f":"#REF!","v":{"$error":"#REF!"}},{"$f":"#REF!","v":{"$error":"#REF!"}},{"$f":"#REF!","v":{"$error":"#REF!"}},{"$f":"10-COUNTIF(#REF!,\"\")","v":{"$error":"#REF!"}},{"$f":"#REF!","v":{"$error":"#REF!"}}]
[null,650,{"$f":"Parametres!Q20","v":""},{"$f":"#REF!","v":{"$error":"#REF!"}},null,{"$f":"#REF!","v":{"$error":"#REF!"}},null,{"$f":"#REF!","v":{"$error":"#REF!"}},null,{"$f":"#REF!","v":{"$error":"#REF!"}},null,{"$f":"#REF!","v":{"$error":"#REF!"}},null,{"$f":"#REF!","v":{"$error":"#REF!"}},null,{"$f":"#REF!","v":{"$error":"#REF!"}},null,{"$f":"#REF!","v":{"$error":"#REF!"}},null,{"$f":"#REF!","v":{"$error":"#REF!"}},{"$f":"#REF!","v":{"$error":"#REF!"}},{"$f":"10-COUNTIF(#REF!,\"\")","v":{"$error":"#REF!"}},{"$f":"#REF!","v":{"$error":"#REF!"}},{"$f":"#REF!","v":{"$error":"#REF!"}},{"$f":"#REF!","v":{"$error":"#REF!"}},{"$f":"10-COUNTIF(#REF!,\"\")","v":{"$error":"#REF!"}},{"$f":"#REF!","v":{"$error":"#REF!"}},{"$f":"#REF!","v":{"$error":"#REF!"}},{"$f":"#REF!","v":{"$error":"#REF!"}},{"$f":"10-COUNTIF(#REF!,\"\")","v":{"$error":"#REF!"}},{"$f":"#REF!","v":{"$error":"#REF!"}},{"$f":"#REF!","v":{"$error":"#REF!"}},{"$f":"#REF!","v":{"$error":"#REF!"}},{"$f":"10-COUNTIF(#REF!,\"\")","v":{"$error":"#REF!"}},{"$f":"#REF!","v":{"$error":"#REF!"}},{"$f":"#REF!","v":{"$error":"#REF!"}},{"$f":"#REF!","v":{"$error":"#REF!"}},{"$f":"10-COUNTIF(#REF!,\"\")","v":{"$error":"#REF!"}},{"$f":"#REF!","v":{"$error":"#REF!"}},{"$f":"#REF!","v":{"$error":"#REF!"}},{"$f":"#REF!","v":{"$error":"#REF!"}},{"$f":"10-COUNTIF(#REF!,\"\")","v":{"$error":"#REF!"}},{"$f":"#REF!","v":{"$error":"#REF!"}},{"$f":"#REF!","v":{"$error":"#REF!"}},{"$f":"#REF!","v":{"$error":"#REF!"}},{"$f":"10-COUNTIF(#REF!,\"\")","v":{"$error":"#REF!"}},{"$f":"#REF!","v":{"$error":"#REF!"}},{"$f":"#REF!","v":{"$error":"#REF!"}},{"$f":"#REF!","v":{"$error":"#REF!"}},{"$f":"10-COUNTIF(#REF!,\"\")","v":{"$error":"#REF!"}},{"$f":"#REF!","v":{"$error":"#REF!"}},{"$f":"#REF!","v":{"$error":"#REF!"}},{"$f":"#REF!","v":{"$error":"#REF!"}},{"$f":"10-COUNTIF(#REF!,\"\")","v":{"$error":"#REF!"}},{"$f":"#REF!","v":{"$error":"#REF!"}},{"$f":"#REF!","v":{"$error":"#REF!"}},{"$f":"#REF!","v":{"$error":"#REF!"}},{"$f":"10-COUNTIF(#REF!,\"\")","v":{"$error":"#REF!"}},{"$f":"#REF!","v":{"$error":"#REF!"}},{"$f":"#REF!","v":{"$error":"#REF!"}},{"$f":"#REF!","v":{"$error":"#REF!"}},{"$f":"10-COUNTIF(#REF!,\"\")","v":{"$error":"#REF!"}},{"$f":"#REF!","v":{"$error":"#REF!"}},{"$f":"#REF!","v":{"$error":"#REF!"}},{"$f":"#REF!","v":{"$error":"#REF!"}},{"$f":"10-COUNTIF(#REF!,\"\")","v":{"$error":"#REF!"}},{"$f":"#REF!","v":{"$error":"#REF!"}}]
[null,681,{"$f":"Parametres!Q21","v":""},{"$f":"#REF!","v":{"$error":"#REF!"}},null,{"$f":"#REF!","v":{"$error":"#REF!"}},null,{"$f":"#REF!","v":{"$error":"#REF!"}},null,{"$f":"#REF!","v":{"$error":"#REF!"}},null,{"$f":"#REF!","v":{"$error":"#REF!"}},null,{"$f":"#REF!","v":{"$error":"#REF!"}},null,{"$f":"#REF!","v":{"$error":"#REF!"}},null,{"$f":"#REF!","v":{"$error":"#REF!"}},null,{"$f":"#REF!","v":{"$error":"#REF!"}},{"$f":"#REF!","v":{"$error":"#REF!"}},{"$f":"10-COUNTIF(#REF!,\"\")","v":{"$error":"#REF!"}},{"$f":"#REF!","v":{"$error":"#REF!"}},{"$f":"#REF!","v":{"$error":"#REF!"}},{"$f":"#REF!","v":{"$error":"#REF!"}},{"$f":"10-COUNTIF(#REF!,\"\")","v":{"$error":"#REF!"}},{"$f":"#REF!","v":{"$error":"#REF!"}},{"$f":"#REF!","v":{"$error":"#REF!"}},{"$f":"#REF!","v":{"$error":"#REF!"}},{"$f":"10-COUNTIF(#REF!,\"\")","v":{"$error":"#REF!"}},{"$f":"#REF!","v":{"$error":"#REF!"}},{"$f":"#REF!","v":{"$error":"#REF!"}},{"$f":"#REF!","v":{"$error":"#REF!"}},{"$f":"10-COUNTIF(#REF!,\"\")","v":{"$error":"#REF!"}},{"$f":"#REF!","v":{"$error":"#REF!"}},{"$f":"#REF!","v":{"$error":"#REF!"}},{"$f":"#REF!","v":{"$error":"#REF!"}},{"$f":"10-COUNTIF(#REF!,\"\")","v":{"$error":"#REF!"}},{"$f":"#REF!","v":{"$error":"#REF!"}},{"$f":"#REF!","v":{"$error":"#REF!"}},{"$f":"#REF!","v":{"$error":"#REF!"}},{"$f":"10-COUNTIF(#REF!,\"\")","v":{"$error":"#REF!"}},{"$f":"#REF!","v":{"$error":"#REF!"}},{"$f":"#REF!","v":{"$error":"#REF!"}},{"$f":"#REF!","v":{"$error":"#REF!"}},{"$f":"10-COUNTIF(#REF!,\"\")","v":{"$error":"#REF!"}},{"$f":"#REF!","v":{"$error":"#REF!"}},{"$f":"#REF!","v":{"$error":"#REF!"}},{"$f":"#REF!","v":{"$error":"#REF!"}},{"$f":"10-COUNTIF(#REF!,\"\")","v":{"$error":"#REF!"}},{"$f":"#REF!","v":{"$error":"#REF!"}},{"$f":"#REF!","v":{"$error":"#REF!"}},{"$f":"#REF!","v":{"$error":"#REF!"}},{"$f":"10-COUNTIF(#REF!,\"\")","v":{"$error":"#REF!"}},{"$f":"#REF!","v":{"$error":"#REF!"}},{"$f":"#REF!","v":{"$error":"#REF!"}},{"$f":"#REF!","v":{"$error":"#REF!"}},{"$f":"10-COUNTIF(#REF!,\"\")","v":{"$error":"#REF!"}},{"$f":"#REF!","v":{"$error":"#REF!"}},{"$f":"#REF!","v":{"$error":"#REF!"}},{"$f":"#REF!","v":{"$error":"#REF!"}},{"$f":"10-COUNTIF(#REF!,\"\")","v":{"$error":"#REF!"}},{"$f":"#REF!","v":{"$error":"#REF!"}},{"$f":"#REF!","v":{"$error":"#REF!"}},{"$f":"#REF!","v":{"$error":"#REF!"}},{"$f":"10-COUNTIF(#REF!,\"\")","v":{"$error":"#REF!"}},{"$f":"#REF!","v":{"$error":"#REF!"}}]
[null,712,{"$f":"Parametres!Q22","v":""},{"$f":"#REF!","v":{"$error":"#REF!"}},null,{"$f":"#REF!","v":{"$error":"#REF!"}},null,{"$f":"#REF!","v":{"$error":"#REF!"}},null,{"$f":"#REF!","v":{"$error":"#REF!"}},null,{"$f":"#REF!","v":{"$error":"#REF!"}},null,{"$f":"#REF!","v":{"$error":"#REF!"}},null,{"$f":"#REF!","v":{"$error":"#REF!"}},null,{"$f":"#REF!","v":{"$error":"#REF!"}},null,{"$f":"#REF!","v":{"$error":"#REF!"}},{"$f":"#REF!","v":{"$error":"#REF!"}},{"$f":"10-COUNTIF(#REF!,\"\")","v":{"$error":"#REF!"}},{"$f":"#REF!","v":{"$error":"#REF!"}},{"$f":"#REF!","v":{"$error":"#REF!"}},{"$f":"#REF!","v":{"$error":"#REF!"}},{"$f":"10-COUNTIF(#REF!,\"\")","v":{"$error":"#REF!"}},{"$f":"#REF!","v":{"$error":"#REF!"}},{"$f":"#REF!","v":{"$error":"#REF!"}},{"$f":"#REF!","v":{"$error":"#REF!"}},{"$f":"10-COUNTIF(#REF!,\"\")","v":{"$error":"#REF!"}},{"$f":"#REF!","v":{"$error":"#REF!"}},{"$f":"#REF!","v":{"$error":"#REF!"}},{"$f":"#REF!","v":{"$error":"#REF!"}},{"$f":"10-COUNTIF(#REF!,\"\")","v":{"$error":"#REF!"}},{"$f":"#REF!","v":{"$error":"#REF!"}},{"$f":"#REF!","v":{"$error":"#REF!"}},{"$f":"#REF!","v":{"$error":"#REF!"}},{"$f":"10-COUNTIF(#REF!,\"\")","v":{"$error":"#REF!"}},{"$f":"#REF!","v":{"$error":"#REF!"}},{"$f":"#REF!","v":{"$error":"#REF!"}},{"$f":"#REF!","v":{"$error":"#REF!"}},{"$f":"10-COUNTIF(#REF!,\"\")","v":{"$error":"#REF!"}},{"$f":"#REF!","v":{"$error":"#REF!"}},{"$f":"#REF!","v":{"$error":"#REF!"}},{"$f":"#REF!","v":{"$error":"#REF!"}},{"$f":"10-COUNTIF(#REF!,\"\")","v":{"$error":"#REF!"}},{"$f":"#REF!","v":{"$error":"#REF!"}},{"$f":"#REF!","v":{"$error":"#REF!"}},{"$f":"#REF!","v":{"$error":"#REF!"}},{"$f":"10-COUNTIF(#REF!,\"\")","v":{"$error":"#REF!"}},{"$f":"#REF!","v":{"$error":"#REF!"}},{"$f":"#REF!","v":{"$error":"#REF!"}},{"$f":"#REF!","v":{"$error":"#REF!"}},{"$f":"10-COUNTIF(#REF!,\"\")","v":{"$error":"#REF!"}},{"$f":"#REF!","v":{"$error":"#REF!"}},{"$f":"#REF!","v":{"$error":"#REF!"}},{"$f":"#REF!","v":{"$error":"#REF!"}},{"$f":"10-COUNTIF(#REF!,\"\")","v":{"$error":"#REF!"}},{"$f":"#REF!","v":{"$error":"#REF!"}},{"$f":"#REF!","v":{"$error":"#REF!"}},{"$f":"#REF!","v":{"$error":"#REF!"}},{"$f":"10-COUNTIF(#REF!,\"\")","v":{"$error":"#REF!"}},{"$f":"#REF!","v":{"$error":"#REF!"}},{"$f":"#REF!","v":{"$error":"#REF!"}},{"$f":"#REF!","v":{"$error":"#REF!"}},{"$f":"10-COUNTIF(#REF!,\"\")","v":{"$error":"#REF!"}},{"$f":"#REF!","v":{"$error":"#REF!"}}]
[null,743,{"$f":"Parametres!Q23","v":""},{"$f":"#REF!","v":{"$error":"#REF!"}},null,{"$f":"#REF!","v":{"$error":"#REF!"}},null,{"$f":"#REF!","v":{"$error":"#REF!"}},null,{"$f":"#REF!","v":{"$error":"#REF!"}},null,{"$f":"#REF!","v":{"$error":"#REF!"}},null,{"$f":"#REF!","v":{"$error":"#REF!"}},null,{"$f":"#REF!","v":{"$error":"#REF!"}},null,{"$f":"#REF!","v":{"$error":"#REF!"}},null,{"$f":"#REF!","v":{"$error":"#REF!"}},{"$f":"#REF!","v":{"$error":"#REF!"}},{"$f":"10-COUNTIF(#REF!,\"\")","v":{"$error":"#REF!"}},{"$f":"#REF!","v":{"$error":"#REF!"}},{"$f":"#REF!","v":{"$error":"#REF!"}},{"$f":"#REF!","v":{"$error":"#REF!"}},{"$f":"10-COUNTIF(#REF!,\"\")","v":{"$error":"#REF!"}},{"$f":"#REF!","v":{"$error":"#REF!"}},{"$f":"#REF!","v":{"$error":"#REF!"}},{"$f":"#REF!","v":{"$error":"#REF!"}},{"$f":"10-COUNTIF(#REF!,\"\")","v":{"$error":"#REF!"}},{"$f":"#REF!","v":{"$error":"#REF!"}},{"$f":"#REF!","v":{"$error":"#REF!"}},{"$f":"#REF!","v":{"$error":"#REF!"}},{"$f":"10-COUNTIF(#REF!,\"\")","v":{"$error":"#REF!"}},{"$f":"#REF!","v":{"$error":"#REF!"}},{"$f":"#REF!","v":{"$error":"#REF!"}},{"$f":"#REF!","v":{"$error":"#REF!"}},{"$f":"10-COUNTIF(#REF!,\"\")","v":{"$error":"#REF!"}},{"$f":"#REF!","v":{"$error":"#REF!"}},{"$f":"#REF!","v":{"$error":"#REF!"}},{"$f":"#REF!","v":{"$error":"#REF!"}},{"$f":"10-COUNTIF(#REF!,\"\")","v":{"$error":"#REF!"}},{"$f":"#REF!","v":{"$error":"#REF!"}},{"$f":"#REF!","v":{"$error":"#REF!"}},{"$f":"#REF!","v":{"$error":"#REF!"}},{"$f":"10-COUNTIF(#REF!,\"\")","v":{"$error":"#REF!"}},{"$f":"#REF!","v":{"$error":"#REF!"}},{"$f":"#REF!","v":{"$error":"#REF!"}},{"$f":"#REF!","v":{"$error":"#REF!"}},{"$f":"10-COUNTIF(#REF!,\"\")","v":{"$error":"#REF!"}},{"$f":"#REF!","v":{"$error":"#REF!"}},{"$f":"#REF!","v":{"$error":"#REF!"}},{"$f":"#REF!","v":{"$error":"#REF!"}},{"$f":"10-COUNTIF(#REF!,\"\")","v":{"$error":"#REF!"}},{"$f":"#REF!","v":{"$error":"#REF!"}},{"$f":"#REF!","v":{"$error":"#REF!"}},{"$f":"#REF!","v":{"$error":"#REF!"}},{"$f":"10-COUNTIF(#REF!,\"\")","v":{"$error":"#REF!"}},{"$f":"#REF!","v":{"$error":"#REF!"}},{"$f":"#REF!","v":{"$error":"#REF!"}},{"$f":"#REF!","v":{"$error":"#REF!"}},{"$f":"10-COUNTIF(#REF!,\"\")","v":{"$error":"#REF!"}},{"$f":"#REF!","v":{"$error":"#REF!"}},{"$f":"#REF!","v":{"$error":"#REF!"}},{"$f":"#REF!","v":{"$error":"#REF!"}},{"$f":"10-COUNTIF(#REF!,\"\")","v":{"$error":"#REF!"}},{"$f":"#REF!","v":{"$error":"#REF!"}}]
[null,774,{"$f":"Parametres!Q24","v":""},{"$f":"#REF!","v":{"$error":"#REF!"}},null,{"$f":"#REF!","v":{"$error":"#REF!"}},null,{"$f":"#REF!","v":{"$error":"#REF!"}},null,{"$f":"#REF!","v":{"$error":"#REF!"}},null,{"$f":"#REF!","v":{"$error":"#REF!"}},null,{"$f":"#REF!","v":{"$error":"#REF!"}},null,{"$f":"#REF!","v":{"$error":"#REF!"}},null,{"$f":"#REF!","v":{"$error":"#REF!"}},null,{"$f":"#REF!","v":{"$error":"#REF!"}},{"$f":"#REF!","v":{"$error":"#REF!"}},{"$f":"10-COUNTIF(#REF!,\"\")","v":{"$error":"#REF!"}},{"$f":"#REF!","v":{"$error":"#REF!"}},{"$f":"#REF!","v":{"$error":"#REF!"}},{"$f":"#REF!","v":{"$error":"#REF!"}},{"$f":"10-COUNTIF(#REF!,\"\")","v":{"$error":"#REF!"}},{"$f":"#REF!","v":{"$error":"#REF!"}},{"$f":"#REF!","v":{"$error":"#REF!"}},{"$f":"#REF!","v":{"$error":"#REF!"}},{"$f":"10-COUNTIF(#REF!,\"\")","v":{"$error":"#REF!"}},{"$f":"#REF!","v":{"$error":"#REF!"}},{"$f":"#REF!","v":{"$error":"#REF!"}},{"$f":"#REF!","v":{"$error":"#REF!"}},{"$f":"10-COUNTIF(#REF!,\"\")","v":{"$error":"#REF!"}},{"$f":"#REF!","v":{"$error":"#REF!"}},{"$f":"#REF!","v":{"$error":"#REF!"}},{"$f":"#REF!","v":{"$error":"#REF!"}},{"$f":"10-COUNTIF(#REF!,\"\")","v":{"$error":"#REF!"}},{"$f":"#REF!","v":{"$error":"#REF!"}},{"$f":"#REF!","v":{"$error":"#REF!"}},{"$f":"#REF!","v":{"$error":"#REF!"}},{"$f":"10-COUNTIF(#REF!,\"\")","v":{"$error":"#REF!"}},{"$f":"#REF!","v":{"$error":"#REF!"}},{"$f":"#REF!","v":{"$error":"#REF!"}},{"$f":"#REF!","v":{"$error":"#REF!"}},{"$f":"10-COUNTIF(#REF!,\"\")","v":{"$error":"#REF!"}},{"$f":"#REF!","v":{"$error":"#REF!"}},{"$f":"#REF!","v":{"$error":"#REF!"}},{"$f":"#REF!","v":{"$error":"#REF!"}},{"$f":"10-COUNTIF(#REF!,\"\")","v":{"$error":"#REF!"}},{"$f":"#REF!","v":{"$error":"#REF!"}},{"$f":"#REF!","v":{"$error":"#REF!"}},{"$f":"#REF!","v":{"$error":"#REF!"}},{"$f":"10-COUNTIF(#REF!,\"\")","v":{"$error":"#REF!"}},{"$f":"#REF!","v":{"$error":"#REF!"}},{"$f":"#REF!","v":{"$error":"#REF!"}},{"$f":"#REF!","v":{"$error":"#REF!"}},{"$f":"10-COUNTIF(#REF!,\"\")","v":{"$error":"#REF!"}},{"$f":"#REF!","v":{"$error":"#REF!"}},{"$f":"#REF!","v":{"$error":"#REF!"}},{"$f":"#REF!","v":{"$error":"#REF!"}},{"$f":"10-COUNTIF(#REF!,\"\")","v":{"$error":"#REF!"}},{"$f":"#REF!","v":{"$error":"#REF!"}},{"$f":"#REF!","v":{"$error":"#REF!"}},{"$f":"#REF!","v":{"$error":"#REF!"}},{"$f":"10-COUNTIF(#REF!,\"\")","v":{"$error":"#REF!"}},{"$f":"#REF!","v":{"$error":"#REF!"}}]
[null,805,{"$f":"Parametres!Q25","v":""},{"$f":"#REF!","v":{"$error":"#REF!"}},null,{"$f":"#REF!","v":{"$error":"#REF!"}},null,{"$f":"#REF!","v":{"$error":"#REF!"}},null,{"$f":"#REF!","v":{"$error":"#REF!"}},null,{"$f":"#REF!","v":{"$error":"#REF!"}},null,{"$f":"#REF!","v":{"$error":"#REF!"}},null,{"$f":"#REF!","v":{"$error":"#REF!"}},null,{"$f":"#REF!","v":{"$error":"#REF!"}},null,{"$f":"#REF!","v":{"$error":"#REF!"}},{"$f":"#REF!","v":{"$error":"#REF!"}},{"$f":"10-COUNTIF(#REF!,\"\")","v":{"$error":"#REF!"}},{"$f":"#REF!","v":{"$error":"#REF!"}},{"$f":"#REF!","v":{"$error":"#REF!"}},{"$f":"#REF!","v":{"$error":"#REF!"}},{"$f":"10-COUNTIF(#REF!,\"\")","v":{"$error":"#REF!"}},{"$f":"#REF!","v":{"$error":"#REF!"}},{"$f":"#REF!","v":{"$error":"#REF!"}},{"$f":"#REF!","v":{"$error":"#REF!"}},{"$f":"10-COUNTIF(#REF!,\"\")","v":{"$error":"#REF!"}},{"$f":"#REF!","v":{"$error":"#REF!"}},{"$f":"#REF!","v":{"$error":"#REF!"}},{"$f":"#REF!","v":{"$error":"#REF!"}},{"$f":"10-COUNTIF(#REF!,\"\")","v":{"$error":"#REF!"}},{"$f":"#REF!","v":{"$error":"#REF!"}},{"$f":"#REF!","v":{"$error":"#REF!"}},{"$f":"#REF!","v":{"$error":"#REF!"}},{"$f":"10-COUNTIF(#REF!,\"\")","v":{"$error":"#REF!"}},{"$f":"#REF!","v":{"$error":"#REF!"}},{"$f":"#REF!","v":{"$error":"#REF!"}},{"$f":"#REF!","v":{"$error":"#REF!"}},{"$f":"10-COUNTIF(#REF!,\"\")","v":{"$error":"#REF!"}},{"$f":"#REF!","v":{"$error":"#REF!"}},{"$f":"#REF!","v":{"$error":"#REF!"}},{"$f":"#REF!","v":{"$error":"#REF!"}},{"$f":"10-COUNTIF(#REF!,\"\")","v":{"$error":"#REF!"}},{"$f":"#REF!","v":{"$error":"#REF!"}},{"$f":"#REF!","v":{"$error":"#REF!"}},{"$f":"#REF!","v":{"$error":"#REF!"}},{"$f":"10-COUNTIF(#REF!,\"\")","v":{"$error":"#REF!"}},{"$f":"#REF!","v":{"$error":"#REF!"}},{"$f":"#REF!","v":{"$error":"#REF!"}},{"$f":"#REF!","v":{"$error":"#REF!"}},{"$f":"10-COUNTIF(#REF!,\"\")","v":{"$error":"#REF!"}},{"$f":"#REF!","v":{"$error":"#REF!"}},{"$f":"#REF!","v":{"$error":"#REF!"}},{"$f":"#REF!","v":{"$error":"#REF!"}},{"$f":"10-COUNTIF(#REF!,\"\")","v":{"$error":"#REF!"}},{"$f":"#REF!","v":{"$error":"#REF!"}},{"$f":"#REF!","v":{"$error":"#REF!"}},{"$f":"#REF!","v":{"$error":"#REF!"}},{"$f":"10-COUNTIF(#REF!,\"\")","v":{"$error":"#REF!"}},{"$f":"#REF!","v":{"$error":"#REF!"}},{"$f":"#REF!","v":{"$error":"#REF!"}},{"$f":"#REF!","v":{"$error":"#REF!"}},{"$f":"10-COUNTIF(#REF!,\"\")","v":{"$error":"#REF!"}},{"$f":"#REF!","v":{"$error":"#REF!"}}]
[null,836,{"$f":"Parametres!Q26","v":""},{"$f":"#REF!","v":{"$error":"#REF!"}},null,{"$f":"#REF!","v":{"$error":"#REF!"}},null,{"$f":"#REF!","v":{"$error":"#REF!"}},null,{"$f":"#REF!","v":{"$error":"#REF!"}},null,{"$f":"#REF!","v":{"$error":"#REF!"}},null,{"$f":"#REF!","v":{"$error":"#REF!"}},null,{"$f":"#REF!","v":{"$error":"#REF!"}},null,{"$f":"#REF!","v":{"$error":"#REF!"}},null,{"$f":"#REF!","v":{"$error":"#REF!"}},{"$f":"#REF!","v":{"$error":"#REF!"}},{"$f":"10-COUNTIF(#REF!,\"\")","v":{"$error":"#REF!"}},{"$f":"#REF!","v":{"$error":"#REF!"}},{"$f":"#REF!","v":{"$error":"#REF!"}},{"$f":"#REF!","v":{"$error":"#REF!"}},{"$f":"10-COUNTIF(#REF!,\"\")","v":{"$error":"#REF!"}},{"$f":"#REF!","v":{"$error":"#REF!"}},{"$f":"#REF!","v":{"$error":"#REF!"}},{"$f":"#REF!","v":{"$error":"#REF!"}},{"$f":"10-COUNTIF(#REF!,\"\")","v":{"$error":"#REF!"}},{"$f":"#REF!","v":{"$error":"#REF!"}},{"$f":"#REF!","v":{"$error":"#REF!"}},{"$f":"#REF!","v":{"$error":"#REF!"}},{"$f":"10-COUNTIF(#REF!,\"\")","v":{"$error":"#REF!"}},{"$f":"#REF!","v":{"$error":"#REF!"}},{"$f":"#REF!","v":{"$error":"#REF!"}},{"$f":"#REF!","v":{"$error":"#REF!"}},{"$f":"10-COUNTIF(#REF!,\"\")","v":{"$error":"#REF!"}},{"$f":"#REF!","v":{"$error":"#REF!"}},{"$f":"#REF!","v":{"$error":"#REF!"}},{"$f":"#REF!","v":{"$error":"#REF!"}},{"$f":"10-COUNTIF(#REF!,\"\")","v":{"$error":"#REF!"}},{"$f":"#REF!","v":{"$error":"#REF!"}},{"$f":"#REF!","v":{"$error":"#REF!"}},{"$f":"#REF!","v":{"$error":"#REF!"}},{"$f":"10-COUNTIF(#REF!,\"\")","v":{"$error":"#REF!"}},{"$f":"#REF!","v":{"$error":"#REF!"}},{"$f":"#REF!","v":{"$error":"#REF!"}},{"$f":"#REF!","v":{"$error":"#REF!"}},{"$f":"10-COUNTIF(#REF!,\"\")","v":{"$error":"#REF!"}},{"$f":"#REF!","v":{"$error":"#REF!"}},{"$f":"#REF!","v":{"$error":"#REF!"}},{"$f":"#REF!","v":{"$error":"#REF!"}},{"$f":"10-COUNTIF(#REF!,\"\")","v":{"$error":"#REF!"}},{"$f":"#REF!","v":{"$error":"#REF!"}},{"$f":"#REF!","v":{"$error":"#REF!"}},{"$f":"#REF!","v":{"$error":"#REF!"}},{"$f":"10-COUNTIF(#REF!,\"\")","v":{"$error":"#REF!"}},{"$f":"#REF!","v":{"$error":"#REF!"}},{"$f":"#REF!","v":{"$error":"#REF!"}},{"$f":"#REF!","v":{"$error":"#REF!"}},{"$f":"10-COUNTIF(#REF!,\"\")","v":{"$error":"#REF!"}},{"$f":"#REF!","v":{"$error":"#REF!"}},{"$f":"#REF!","v":{"$error":"#REF!"}},{"$f":"#REF!","v":{"$error":"#REF!"}},{"$f":"10-COUNTIF(#REF!,\"\")","v":{"$error":"#REF!"}},{"$f":"#REF!","v":{"$error":"#REF!"}}]
[null,867,{"$f":"Parametres!Q27","v":""},{"$f":"#REF!","v":{"$error":"#REF!"}},null,{"$f":"#REF!","v":{"$error":"#REF!"}},null,{"$f":"#REF!","v":{"$error":"#REF!"}},null,{"$f":"#REF!","v":{"$error":"#REF!"}},null,{"$f":"#REF!","v":{"$error":"#REF!"}},null,{"$f":"#REF!","v":{"$error":"#REF!"}},null,{"$f":"#REF!","v":{"$error":"#REF!"}},null,{"$f":"#REF!","v":{"$error":"#REF!"}},null,{"$f":"#REF!","v":{"$error":"#REF!"}},{"$f":"#REF!","v":{"$error":"#REF!"}},{"$f":"10-COUNTIF(#REF!,\"\")","v":{"$error":"#REF!"}},{"$f":"#REF!","v":{"$error":"#REF!"}},{"$f":"#REF!","v":{"$error":"#REF!"}},{"$f":"#REF!","v":{"$error":"#REF!"}},{"$f":"10-COUNTIF(#REF!,\"\")","v":{"$error":"#REF!"}},{"$f":"#REF!","v":{"$error":"#REF!"}},{"$f":"#REF!","v":{"$error":"#REF!"}},{"$f":"#REF!","v":{"$error":"#REF!"}},{"$f":"10-COUNTIF(#REF!,\"\")","v":{"$error":"#REF!"}},{"$f":"#REF!","v":{"$error":"#REF!"}},{"$f":"#REF!","v":{"$error":"#REF!"}},{"$f":"#REF!","v":{"$error":"#REF!"}},{"$f":"10-COUNTIF(#REF!,\"\")","v":{"$error":"#REF!"}},{"$f":"#REF!","v":{"$error":"#REF!"}},{"$f":"#REF!","v":{"$error":"#REF!"}},{"$f":"#REF!","v":{"$error":"#REF!"}},{"$f":"10-COUNTIF(#REF!,\"\")","v":{"$error":"#REF!"}},{"$f":"#REF!","v":{"$error":"#REF!"}},{"$f":"#REF!","v":{"$error":"#REF!"}},{"$f":"#REF!","v":{"$error":"#REF!"}},{"$f":"10-COUNTIF(#REF!,\"\")","v":{"$error":"#REF!"}},{"$f":"#REF!","v":{"$error":"#REF!"}},{"$f":"#REF!","v":{"$error":"#REF!"}},{"$f":"#REF!","v":{"$error":"#REF!"}},{"$f":"10-COUNTIF(#REF!,\"\")","v":{"$error":"#REF!"}},{"$f":"#REF!","v":{"$error":"#REF!"}},{"$f":"#REF!","v":{"$error":"#REF!"}},{"$f":"#REF!","v":{"$error":"#REF!"}},{"$f":"10-COUNTIF(#REF!,\"\")","v":{"$error":"#REF!"}},{"$f":"#REF!","v":{"$error":"#REF!"}},{"$f":"#REF!","v":{"$error":"#REF!"}},{"$f":"#REF!","v":{"$error":"#REF!"}},{"$f":"10-COUNTIF(#REF!,\"\")","v":{"$error":"#REF!"}},{"$f":"#REF!","v":{"$error":"#REF!"}},{"$f":"#REF!","v":{"$error":"#REF!"}},{"$f":"#REF!","v":{"$error":"#REF!"}},{"$f":"10-COUNTIF(#REF!,\"\")","v":{"$error":"#REF!"}},{"$f":"#REF!","v":{"$error":"#REF!"}},{"$f":"#REF!","v":{"$error":"#REF!"}},{"$f":"#REF!","v":{"$error":"#REF!"}},{"$f":"10-COUNTIF(#REF!,\"\")","v":{"$error":"#REF!"}},{"$f":"#REF!","v":{"$error":"#REF!"}},{"$f":"#REF!","v":{"$error":"#REF!"}},{"$f":"#REF!","v":{"$error":"#REF!"}},{"$f":"10-COUNTIF(#REF!,\"\")","v":{"$error":"#REF!"}},{"$f":"#REF!","v":{"$error":"#REF!"}}]
[null,898,{"$f":"Parametres!Q28","v":""},{"$f":"#REF!","v":{"$error":"#REF!"}},null,{"$f":"#REF!","v":{"$error":"#REF!"}},null,{"$f":"#REF!","v":{"$error":"#REF!"}},null,{"$f":"#REF!","v":{"$error":"#REF!"}},null,{"$f":"#REF!","v":{"$error":"#REF!"}},null,{"$f":"#REF!","v":{"$error":"#REF!"}},null,{"$f":"#REF!","v":{"$error":"#REF!"}},null,{"$f":"#REF!","v":{"$error":"#REF!"}},null,{"$f":"#REF!","v":{"$error":"#REF!"}},{"$f":"#REF!","v":{"$error":"#REF!"}},{"$f":"10-COUNTIF(#REF!,\"\")","v":{"$error":"#REF!"}},{"$f":"#REF!","v":{"$error":"#REF!"}},{"$f":"#REF!","v":{"$error":"#REF!"}},{"$f":"#REF!","v":{"$error":"#REF!"}},{"$f":"10-COUNTIF(#REF!,\"\")","v":{"$error":"#REF!"}},{"$f":"#REF!","v":{"$error":"#REF!"}},{"$f":"#REF!","v":{"$error":"#REF!"}},{"$f":"#REF!","v":{"$error":"#REF!"}},{"$f":"10-COUNTIF(#REF!,\"\")","v":{"$error":"#REF!"}},{"$f":"#REF!","v":{"$error":"#REF!"}},{"$f":"#REF!","v":{"$error":"#REF!"}},{"$f":"#REF!","v":{"$error":"#REF!"}},{"$f":"10-COUNTIF(#REF!,\"\")","v":{"$error":"#REF!"}},{"$f":"#REF!","v":{"$error":"#REF!"}},{"$f":"#REF!","v":{"$error":"#REF!"}},{"$f":"#REF!","v":{"$error":"#REF!"}},{"$f":"10-COUNTIF(#REF!,\"\")","v":{"$error":"#REF!"}},{"$f":"#REF!","v":{"$error":"#REF!"}},{"$f":"#REF!","v":{"$error":"#REF!"}},{"$f":"#REF!","v":{"$error":"#REF!"}},{"$f":"10-COUNTIF(#REF!,\"\")","v":{"$error":"#REF!"}},{"$f":"#REF!","v":{"$error":"#REF!"}},{"$f":"#REF!","v":{"$error":"#REF!"}},{"$f":"#REF!","v":{"$error":"#REF!"}},{"$f":"10-COUNTIF(#REF!,\"\")","v":{"$error":"#REF!"}},{"$f":"#REF!","v":{"$error":"#REF!"}},{"$f":"#REF!","v":{"$error":"#REF!"}},{"$f":"#REF!","v":{"$error":"#REF!"}},{"$f":"10-COUNTIF(#REF!,\"\")","v":{"$error":"#REF!"}},{"$f":"#REF!","v":{"$error":"#REF!"}},{"$f":"#REF!","v":{"$error":"#REF!"}},{"$f":"#REF!","v":{"$error":"#REF!"}},{"$f":"10-COUNTIF(#REF!,\"\")","v":{"$error":"#REF!"}},{"$f":"#REF!","v":{"$error":"#REF!"}},{"$f":"#REF!","v":{"$error":"#REF!"}},{"$f":"#REF!","v":{"$error":"#REF!"}},{"$f":"10-COUNTIF(#REF!,\"\")","v":{"$error":"#REF!"}},{"$f":"#REF!","v":{"$error":"#REF!"}},{"$f":"#REF!","v":{"$error":"#REF!"}},{"$f":"#REF!","v":{"$error":"#REF!"}},{"$f":"10-COUNTIF(#REF!,\"\")","v":{"$error":"#REF!"}},{"$f":"#REF!","v":{"$error":"#REF!"}},{"$f":"#REF!","v":{"$error":"#REF!"}},{"$f":"#REF!","v":{"$error":"#REF!"}},{"$f":"10-COUNTIF(#REF!,\"\")","v":{"$error":"#REF!"}},{"$f":"#REF!","v":{"$error":"#REF!"}}]
[null,929,{"$f":"Parametres!Q29","v":""},{"$f":"#REF!","v":{"$error":"#REF!"}},null,{"$f":"#REF!","v":{"$error":"#REF!"}},null,{"$f":"#REF!","v":{"$error":"#REF!"}},null,{"$f":"#REF!","v":{"$error":"#REF!"}},null,{"$f":"#REF!","v":{"$error":"#REF!"}},null,{"$f":"#REF!","v":{"$error":"#REF!"}},null,{"$f":"#REF!","v":{"$error":"#REF!"}},null,{"$f":"#REF!","v":{"$error":"#REF!"}},null,{"$f":"#REF!","v":{"$error":"#REF!"}},{"$f":"#REF!","v":{"$error":"#REF!"}},{"$f":"10-COUNTIF(#REF!,\"\")","v":{"$error":"#REF!"}},{"$f":"#REF!","v":{"$error":"#REF!"}},{"$f":"#REF!","v":{"$error":"#REF!"}},{"$f":"#REF!","v":{"$error":"#REF!"}},{"$f":"10-COUNTIF(#REF!,\"\")","v":{"$error":"#REF!"}},{"$f":"#REF!","v":{"$error":"#REF!"}},{"$f":"#REF!","v":{"$error":"#REF!"}},{"$f":"#REF!","v":{"$error":"#REF!"}},{"$f":"10-COUNTIF(#REF!,\"\")","v":{"$error":"#REF!"}},{"$f":"#REF!","v":{"$error":"#REF!"}},{"$f":"#REF!","v":{"$error":"#REF!"}},{"$f":"#REF!","v":{"$error":"#REF!"}},{"$f":"10-COUNTIF(#REF!,\"\")","v":{"$error":"#REF!"}},{"$f":"#REF!","v":{"$error":"#REF!"}},{"$f":"#REF!","v":{"$error":"#REF!"}},{"$f":"#REF!","v":{"$error":"#REF!"}},{"$f":"10-COUNTIF(#REF!,\"\")","v":{"$error":"#REF!"}},{"$f":"#REF!","v":{"$error":"#REF!"}},{"$f":"#REF!","v":{"$error":"#REF!"}},{"$f":"#REF!","v":{"$error":"#REF!"}},{"$f":"10-COUNTIF(#REF!,\"\")","v":{"$error":"#REF!"}},{"$f":"#REF!","v":{"$error":"#REF!"}},{"$f":"#REF!","v":{"$error":"#REF!"}},{"$f":"#REF!","v":{"$error":"#REF!"}},{"$f":"10-COUNTIF(#REF!,\"\")","v":{"$error":"#REF!"}},{"$f":"#REF!","v":{"$error":"#REF!"}},{"$f":"#REF!","v":{"$error":"#REF!"}},{"$f":"#REF!","v":{"$error":"#REF!"}},{"$f":"10-COUNTIF(#REF!,\"\")","v":{"$error":"#REF!"}},{"$f":"#REF!","v":{"$error":"#REF!"}},{"$f":"#REF!","v":{"$error":"#REF!"}},{"$f":"#REF!","v":{"$error":"#REF!"}},{"$f":"10-COUNTIF(#REF!,\"\")","v":{"$error":"#REF!"}},{"$f":"#REF!","v":{"$error":"#REF!"}},{"$f":"#REF!","v":{"$error":"#REF!"}},{"$f":"#REF!","v":{"$error":"#REF!"}},{"$f":"10-COUNTIF(#REF!,\"\")","v":{"$error":"#REF!"}},{"$f":"#REF!","v":{"$error":"#REF!"}},{"$f":"#REF!","v":{"$error":"#REF!"}},{"$f":"#REF!","v":{"$error":"#REF!"}},{"$f":"10-COUNTIF(#REF!,\"\")","v":{"$error":"#REF!"}},{"$f":"#REF!","v":{"$error":"#REF!"}},{"$f":"#REF!","v":{"$error":"#REF!"}},{"$f":"#REF!","v":{"$error":"#REF!"}},{"$f":"10-COUNTIF(#REF!,\"\")","v":{"$error":"#REF!"}},{"$f":"#REF!","v":{"$error":"#REF!"}}]
[null,960,{"$f":"Parametres!Q30","v":""},{"$f":"#REF!","v":{"$error":"#REF!"}},null,{"$f":"#REF!","v":{"$error":"#REF!"}},null,{"$f":"#REF!","v":{"$error":"#REF!"}},null,{"$f":"#REF!","v":{"$error":"#REF!"}},null,{"$f":"#REF!","v":{"$error":"#REF!"}},null,{"$f":"#REF!","v":{"$error":"#REF!"}},null,{"$f":"#REF!","v":{"$error":"#REF!"}},null,{"$f":"#REF!","v":{"$error":"#REF!"}},null,{"$f":"#REF!","v":{"$error":"#REF!"}},{"$f":"#REF!","v":{"$error":"#REF!"}},{"$f":"10-COUNTIF(#REF!,\"\")","v":{"$error":"#REF!"}},{"$f":"#REF!","v":{"$error":"#REF!"}},{"$f":"#REF!","v":{"$error":"#REF!"}},{"$f":"#REF!","v":{"$error":"#REF!"}},{"$f":"10-COUNTIF(#REF!,\"\")","v":{"$error":"#REF!"}},{"$f":"#REF!","v":{"$error":"#REF!"}},{"$f":"#REF!","v":{"$error":"#REF!"}},{"$f":"#REF!","v":{"$error":"#REF!"}},{"$f":"10-COUNTIF(#REF!,\"\")","v":{"$error":"#REF!"}},{"$f":"#REF!","v":{"$error":"#REF!"}},{"$f":"#REF!","v":{"$error":"#REF!"}},{"$f":"#REF!","v":{"$error":"#REF!"}},{"$f":"10-COUNTIF(#REF!,\"\")","v":{"$error":"#REF!"}},{"$f":"#REF!","v":{"$error":"#REF!"}},{"$f":"#REF!","v":{"$error":"#REF!"}},{"$f":"#REF!","v":{"$error":"#REF!"}},{"$f":"10-COUNTIF(#REF!,\"\")","v":{"$error":"#REF!"}},{"$f":"#REF!","v":{"$error":"#REF!"}},{"$f":"#REF!","v":{"$error":"#REF!"}},{"$f":"#REF!","v":{"$error":"#REF!"}},{"$f":"10-COUNTIF(#REF!,\"\")","v":{"$error":"#REF!"}},{"$f":"#REF!","v":{"$error":"#REF!"}},{"$f":"#REF!","v":{"$error":"#REF!"}},{"$f":"#REF!","v":{"$error":"#REF!"}},{"$f":"10-COUNTIF(#REF!,\"\")","v":{"$error":"#REF!"}},{"$f":"#REF!","v":{"$error":"#REF!"}},{"$f":"#REF!","v":{"$error":"#REF!"}},{"$f":"#REF!","v":{"$error":"#REF!"}},{"$f":"10-COUNTIF(#REF!,\"\")","v":{"$error":"#REF!"}},{"$f":"#REF!","v":{"$error":"#REF!"}},{"$f":"#REF!","v":{"$error":"#REF!"}},{"$f":"#REF!","v":{"$error":"#REF!"}},{"$f":"10-COUNTIF(#REF!,\"\")","v":{"$error":"#REF!"}},{"$f":"#REF!","v":{"$error":"#REF!"}},{"$f":"#REF!","v":{"$error":"#REF!"}},{"$f":"#REF!","v":{"$error":"#REF!"}},{"$f":"10-COUNTIF(#REF!,\"\")","v":{"$error":"#REF!"}},{"$f":"#REF!","v":{"$error":"#REF!"}},{"$f":"#REF!","v":{"$error":"#REF!"}},{"$f":"#REF!","v":{"$error":"#REF!"}},{"$f":"10-COUNTIF(#REF!,\"\")","v":{"$error":"#REF!"}},{"$f":"#REF!","v":{"$error":"#REF!"}},{"$f":"#REF!","v":{"$error":"#REF!"}},{"$f":"#REF!","v":{"$error":"#REF!"}},{"$f":"10-COUNTIF(#REF!,\"\")","v":{"$error":"#REF!"}},{"$f":"#REF!","v":{"$error":"#REF!"}}]
[null,null,{"$f":"Parametres!Q31","v":""},{"$f":"#REF!","v":{"$error":"#REF!"}},null,{"$f":"#REF!","v":{"$error":"#REF!"}},null,{"$f":"#REF!","v":{"$error":"#REF!"}},null,{"$f":"#REF!","v":{"$error":"#REF!"}},null,{"$f":"#REF!","v":{"$error":"#REF!"}},null,{"$f":"#REF!","v":{"$error":"#REF!"}},null,{"$f":"#REF!","v":{"$error":"#REF!"}},null,{"$f":"#REF!","v":{"$error":"#REF!"}},null,{"$f":"#REF!","v":{"$error":"#REF!"}},{"$f":"#REF!","v":{"$error":"#REF!"}},{"$f":"10-COUNTIF(#REF!,\"\")","v":{"$error":"#REF!"}},{"$f":"#REF!","v":{"$error":"#REF!"}},{"$f":"#REF!","v":{"$error":"#REF!"}},{"$f":"#REF!","v":{"$error":"#REF!"}},{"$f":"10-COUNTIF(#REF!,\"\")","v":{"$error":"#REF!"}},{"$f":"#REF!","v":{"$error":"#REF!"}},{"$f":"#REF!","v":{"$error":"#REF!"}},{"$f":"#REF!","v":{"$error":"#REF!"}},{"$f":"10-COUNTIF(#REF!,\"\")","v":{"$error":"#REF!"}},{"$f":"#REF!","v":{"$error":"#REF!"}},{"$f":"#REF!","v":{"$error":"#REF!"}},{"$f":"#REF!","v":{"$error":"#REF!"}},{"$f":"10-COUNTIF(#REF!,\"\")","v":{"$error":"#REF!"}},{"$f":"#REF!","v":{"$error":"#REF!"}},{"$f":"#REF!","v":{"$error":"#REF!"}},{"$f":"#REF!","v":{"$error":"#REF!"}},{"$f":"10-COUNTIF(#REF!,\"\")","v":{"$error":"#REF!"}},{"$f":"#REF!","v":{"$error":"#REF!"}},{"$f":"#REF!","v":{"$error":"#REF!"}},{"$f":"#REF!","v":{"$error":"#REF!"}},{"$f":"10-COUNTIF(#REF!,\"\")","v":{"$error":"#REF!"}},{"$f":"#REF!","v":{"$error":"#REF!"}},{"$f":"#REF!","v":{"$error":"#REF!"}},{"$f":"#REF!","v":{"$error":"#REF!"}},{"$f":"10-COUNTIF(#REF!,\"\")","v":{"$error":"#REF!"}},{"$f":"#REF!","v":{"$error":"#REF!"}},{"$f":"#REF!","v":{"$error":"#REF!"}},{"$f":"#REF!","v":{"$error":"#REF!"}},{"$f":"10-COUNTIF(#REF!,\"\")","v":{"$error":"#REF!"}},{"$f":"#REF!","v":{"$error":"#REF!"}},{"$f":"#REF!","v":{"$error":"#REF!"}},{"$f":"#REF!","v":{"$error":"#REF!"}},{"$f":"10-COUNTIF(#REF!,\"\")","v":{"$error":"#REF!"}},{"$f":"#REF!","v":{"$error":"#REF!"}},{"$f":"#REF!","v":{"$error":"#REF!"}},{"$f":"#REF!","v":{"$error":"#REF!"}},{"$f":"10-COUNTIF(#REF!,\"\")","v":{"$error":"#REF!"}},{"$f":"#REF!","v":{"$error":"#REF!"}},{"$f":"#REF!","v":{"$error":"#REF!"}},{"$f":"#REF!","v":{"$error":"#REF!"}},{"$f":"10-COUNTIF(#REF!,\"\")","v":{"$error":"#REF!"}},{"$f":"#REF!","v":{"$error":"#REF!"}},{"$f":"#REF!","v":{"$error":"#REF!"}},{"$f":"#REF!","v":{"$error":"#REF!"}},{"$f":"10-COUNTIF(#REF!,\"\")","v":{"$error":"#REF!"}},{"$f":"#REF!","v":{"$error":"#REF!"}}]
[null,null,{"$f":"Parametres!Q32","v":""},{"$f":"#REF!","v":{"$error":"#REF!"}},null,{"$f":"#REF!","v":{"$error":"#REF!"}},null,{"$f":"#REF!","v":{"$error":"#REF!"}},null,{"$f":"#REF!","v":{"$error":"#REF!"}},null,{"$f":"#REF!","v":{"$error":"#REF!"}},null,{"$f":"#REF!","v":{"$error":"#REF!"}},null,{"$f":"#REF!","v":{"$error":"#REF!"}},null,{"$f":"#REF!","v":{"$error":"#REF!"}},null,{"$f":"#REF!","v":{"$error":"#REF!"}},{"$f":"#REF!","v":{"$error":"#REF!"}},{"$f":"10-COUNTIF(#REF!,\"\")","v":{"$error":"#REF!"}},{"$f":"#REF!","v":{"$error":"#REF!"}},{"$f":"#REF!","v":{"$error":"#REF!"}},{"$f":"#REF!","v":{"$error":"#REF!"}},{"$f":"10-COUNTIF(#REF!,\"\")","v":{"$error":"#REF!"}},{"$f":"#REF!","v":{"$error":"#REF!"}},{"$f":"#REF!","v":{"$error":"#REF!"}},{"$f":"#REF!","v":{"$error":"#REF!"}},{"$f":"10-COUNTIF(#REF!,\"\")","v":{"$error":"#REF!"}},{"$f":"#REF!","v":{"$error":"#REF!"}},{"$f":"#REF!","v":{"$error":"#REF!"}},{"$f":"#REF!","v":{"$error":"#REF!"}},{"$f":"10-COUNTIF(#REF!,\"\")","v":{"$error":"#REF!"}},{"$f":"#REF!","v":{"$error":"#REF!"}},{"$f":"#REF!","v":{"$error":"#REF!"}},{"$f":"#REF!","v":{"$error":"#REF!"}},{"$f":"10-COUNTIF(#REF!,\"\")","v":{"$error":"#REF!"}},{"$f":"#REF!","v":{"$error":"#REF!"}},{"$f":"#REF!","v":{"$error":"#REF!"}},{"$f":"#REF!","v":{"$error":"#REF!"}},{"$f":"10-COUNTIF(#REF!,\"\")","v":{"$error":"#REF!"}},{"$f":"#REF!","v":{"$error":"#REF!"}},{"$f":"#REF!","v":{"$error":"#REF!"}},{"$f":"#REF!","v":{"$error":"#REF!"}},{"$f":"10-COUNTIF(#REF!,\"\")","v":{"$error":"#REF!"}},{"$f":"#REF!","v":{"$error":"#REF!"}},{"$f":"#REF!","v":{"$error":"#REF!"}},{"$f":"#REF!","v":{"$error":"#REF!"}},{"$f":"10-COUNTIF(#REF!,\"\")","v":{"$error":"#REF!"}},{"$f":"#REF!","v":{"$error":"#REF!"}},{"$f":"#REF!","v":{"$error":"#REF!"}},{"$f":"#REF!","v":{"$error":"#REF!"}},{"$f":"10-COUNTIF(#REF!,\"\")","v":{"$error":"#REF!"}},{"$f":"#REF!","v":{"$error":"#REF!"}},{"$f":"#REF!","v":{"$error":"#REF!"}},{"$f":"#REF!","v":{"$error":"#REF!"}},{"$f":"10-COUNTIF(#REF!,\"\")","v":{"$error":"#REF!"}},{"$f":"#REF!","v":{"$error":"#REF!"}},{"$f":"#REF!","v":{"$error":"#REF!"}},{"$f":"#REF!","v":{"$error":"#REF!"}},{"$f":"10-COUNTIF(#REF!,\"\")","v":{"$error":"#REF!"}},{"$f":"#REF!","v":{"$error":"#REF!"}},{"$f":"#REF!","v":{"$error":"#REF!"}},{"$f":"#REF!","v":{"$error":"#REF!"}},{"$f":"10-COUNTIF(#REF!,\"\")","v":{"$error":"#REF!"}},{"$f":"#REF!","v":{"$error":"#REF!"}}]
[null,null,{"$f":"Parametres!Q33","v":""},{"$f":"#REF!","v":{"$error":"#REF!"}},null,{"$f":"#REF!","v":{"$error":"#REF!"}},null,{"$f":"#REF!","v":{"$error":"#REF!"}},null,{"$f":"#REF!","v":{"$error":"#REF!"}},null,{"$f":"#REF!","v":{"$error":"#REF!"}},null,{"$f":"#REF!","v":{"$error":"#REF!"}},null,{"$f":"#REF!","v":{"$error":"#REF!"}},null,{"$f":"#REF!","v":{"$error":"#REF!"}},null,{"$f":"#REF!","v":{"$error":"#REF!"}},{"$f":"#REF!","v":{"$error":"#REF!"}},{"$f":"10-COUNTIF(#REF!,\"\")","v":{"$error":"#REF!"}},{"$f":"#REF!","v":{"$error":"#REF!"}},{"$f":"#REF!","v":{"$error":"#REF!"}},{"$f":"#REF!","v":{"$error":"#REF!"}},{"$f":"10-COUNTIF(#REF!,\"\")","v":{"$error":"#REF!"}},{"$f":"#REF!","v":{"$error":"#REF!"}},{"$f":"#REF!","v":{"$error":"#REF!"}},{"$f":"#REF!","v":{"$error":"#REF!"}},{"$f":"10-COUNTIF(#REF!,\"\")","v":{"$error":"#REF!"}},{"$f":"#REF!","v":{"$error":"#REF!"}},{"$f":"#REF!","v":{"$error":"#REF!"}},{"$f":"#REF!","v":{"$error":"#REF!"}},{"$f":"10-COUNTIF(#REF!,\"\")","v":{"$error":"#REF!"}},{"$f":"#REF!","v":{"$error":"#REF!"}},{"$f":"#REF!","v":{"$error":"#REF!"}},{"$f":"#REF!","v":{"$error":"#REF!"}},{"$f":"10-COUNTIF(#REF!,\"\")","v":{"$error":"#REF!"}},{"$f":"#REF!","v":{"$error":"#REF!"}},{"$f":"#REF!","v":{"$error":"#REF!"}},{"$f":"#REF!","v":{"$error":"#REF!"}},{"$f":"10-COUNTIF(#REF!,\"\")","v":{"$error":"#REF!"}},{"$f":"#REF!","v":{"$error":"#REF!"}},{"$f":"#REF!","v":{"$error":"#REF!"}},{"$f":"#REF!","v":{"$error":"#REF!"}},{"$f":"10-COUNTIF(#REF!,\"\")","v":{"$error":"#REF!"}},{"$f":"#REF!","v":{"$error":"#REF!"}},{"$f":"#REF!","v":{"$error":"#REF!"}},{"$f":"#REF!","v":{"$error":"#REF!"}},{"$f":"10-COUNTIF(#REF!,\"\")","v":{"$error":"#REF!"}},{"$f":"#REF!","v":{"$error":"#REF!"}},{"$f":"#REF!","v":{"$error":"#REF!"}},{"$f":"#REF!","v":{"$error":"#REF!"}},{"$f":"10-COUNTIF(#REF!,\"\")","v":{"$error":"#REF!"}},{"$f":"#REF!","v":{"$error":"#REF!"}},{"$f":"#REF!","v":{"$error":"#REF!"}},{"$f":"#REF!","v":{"$error":"#REF!"}},{"$f":"10-COUNTIF(#REF!,\"\")","v":{"$error":"#REF!"}},{"$f":"#REF!","v":{"$error":"#REF!"}},{"$f":"#REF!","v":{"$error":"#REF!"}},{"$f":"#REF!","v":{"$error":"#REF!"}},{"$f":"10-COUNTIF(#REF!,\"\")","v":{"$error":"#REF!"}},{"$f":"#REF!","v":{"$error":"#REF!"}},{"$f":"#REF!","v":{"$error":"#REF!"}},{"$f":"#REF!","v":{"$error":"#REF!"}},{"$f":"10-COUNTIF(#REF!,\"\")","v":{"$error":"#REF!"}},{"$f":"#REF!","v":{"$error":"#REF!"}}]
[null,null,{"$f":"Parametres!Q34","v":""},{"$f":"#REF!","v":{"$error":"#REF!"}},null,{"$f":"#REF!","v":{"$error":"#REF!"}},null,{"$f":"#REF!","v":{"$error":"#REF!"}},null,{"$f":"#REF!","v":{"$error":"#REF!"}},null,{"$f":"#REF!","v":{"$error":"#REF!"}},null,{"$f":"#REF!","v":{"$error":"#REF!"}},null,{"$f":"#REF!","v":{"$error":"#REF!"}},null,{"$f":"#REF!","v":{"$error":"#REF!"}},null,{"$f":"#REF!","v":{"$error":"#REF!"}},{"$f":"#REF!","v":{"$error":"#REF!"}},{"$f":"10-COUNTIF(#REF!,\"\")","v":{"$error":"#REF!"}},{"$f":"#REF!","v":{"$error":"#REF!"}},{"$f":"#REF!","v":{"$error":"#REF!"}},{"$f":"#REF!","v":{"$error":"#REF!"}},{"$f":"10-COUNTIF(#REF!,\"\")","v":{"$error":"#REF!"}},{"$f":"#REF!","v":{"$error":"#REF!"}},{"$f":"#REF!","v":{"$error":"#REF!"}},{"$f":"#REF!","v":{"$error":"#REF!"}},{"$f":"10-COUNTIF(#REF!,\"\")","v":{"$error":"#REF!"}},{"$f":"#REF!","v":{"$error":"#REF!"}},{"$f":"#REF!","v":{"$error":"#REF!"}},{"$f":"#REF!","v":{"$error":"#REF!"}},{"$f":"10-COUNTIF(#REF!,\"\")","v":{"$error":"#REF!"}},{"$f":"#REF!","v":{"$error":"#REF!"}},{"$f":"#REF!","v":{"$error":"#REF!"}},{"$f":"#REF!","v":{"$error":"#REF!"}},{"$f":"10-COUNTIF(#REF!,\"\")","v":{"$error":"#REF!"}},{"$f":"#REF!","v":{"$error":"#REF!"}},{"$f":"#REF!","v":{"$error":"#REF!"}},{"$f":"#REF!","v":{"$error":"#REF!"}},{"$f":"10-COUNTIF(#REF!,\"\")","v":{"$error":"#REF!"}},{"$f":"#REF!","v":{"$error":"#REF!"}},{"$f":"#REF!","v":{"$error":"#REF!"}},{"$f":"#REF!","v":{"$error":"#REF!"}},{"$f":"10-COUNTIF(#REF!,\"\")","v":{"$error":"#REF!"}},{"$f":"#REF!","v":{"$error":"#REF!"}},{"$f":"#REF!","v":{"$error":"#REF!"}},{"$f":"#REF!","v":{"$error":"#REF!"}},{"$f":"10-COUNTIF(#REF!,\"\")","v":{"$error":"#REF!"}},{"$f":"#REF!","v":{"$error":"#REF!"}},{"$f":"#REF!","v":{"$error":"#REF!"}},{"$f":"#REF!","v":{"$error":"#REF!"}},{"$f":"10-COUNTIF(#REF!,\"\")","v":{"$error":"#REF!"}},{"$f":"#REF!","v":{"$error":"#REF!"}},{"$f":"#REF!","v":{"$error":"#REF!"}},{"$f":"#REF!","v":{"$error":"#REF!"}},{"$f":"10-COUNTIF(#REF!,\"\")","v":{"$error":"#REF!"}},{"$f":"#REF!","v":{"$error":"#REF!"}},{"$f":"#REF!","v":{"$error":"#REF!"}},{"$f":"#REF!","v":{"$error":"#REF!"}},{"$f":"10-COUNTIF(#REF!,\"\")","v":{"$error":"#REF!"}},{"$f":"#REF!","v":{"$error":"#REF!"}},{"$f":"#REF!","v":{"$error":"#REF!"}},{"$f":"#REF!","v":{"$error":"#REF!"}},{"$f":"10-COUNTIF(#REF!,\"\")","v":{"$error":"#REF!"}},{"$f":"#REF!","v":{"$error":"#REF!"}}]
[null,null,{"$f":"Parametres!Q35","v":""},{"$f":"#REF!","v":{"$error":"#REF!"}},null,{"$f":"#REF!","v":{"$error":"#REF!"}},null,{"$f":"#REF!","v":{"$error":"#REF!"}},null,{"$f":"#REF!","v":{"$error":"#REF!"}},null,{"$f":"#REF!","v":{"$error":"#REF!"}},null,{"$f":"#REF!","v":{"$error":"#REF!"}},null,{"$f":"#REF!","v":{"$error":"#REF!"}},null,{"$f":"#REF!","v":{"$error":"#REF!"}},null,{"$f":"#REF!","v":{"$error":"#REF!"}},{"$f":"#REF!","v":{"$error":"#REF!"}},{"$f":"10-COUNTIF(#REF!,\"\")","v":{"$error":"#REF!"}},{"$f":"#REF!","v":{"$error":"#REF!"}},{"$f":"#REF!","v":{"$error":"#REF!"}},{"$f":"#REF!","v":{"$error":"#REF!"}},{"$f":"10-COUNTIF(#REF!,\"\")","v":{"$error":"#REF!"}},{"$f":"#REF!","v":{"$error":"#REF!"}},{"$f":"#REF!","v":{"$error":"#REF!"}},{"$f":"#REF!","v":{"$error":"#REF!"}},{"$f":"10-COUNTIF(#REF!,\"\")","v":{"$error":"#REF!"}},{"$f":"#REF!","v":{"$error":"#REF!"}},{"$f":"#REF!","v":{"$error":"#REF!"}},{"$f":"#REF!","v":{"$error":"#REF!"}},{"$f":"10-COUNTIF(#REF!,\"\")","v":{"$error":"#REF!"}},{"$f":"#REF!","v":{"$error":"#REF!"}},{"$f":"#REF!","v":{"$error":"#REF!"}},{"$f":"#REF!","v":{"$error":"#REF!"}},{"$f":"10-COUNTIF(#REF!,\"\")","v":{"$error":"#REF!"}},{"$f":"#REF!","v":{"$error":"#REF!"}},{"$f":"#REF!","v":{"$error":"#REF!"}},{"$f":"#REF!","v":{"$error":"#REF!"}},{"$f":"10-COUNTIF(#REF!,\"\")","v":{"$error":"#REF!"}},{"$f":"#REF!","v":{"$error":"#REF!"}},{"$f":"#REF!","v":{"$error":"#REF!"}},{"$f":"#REF!","v":{"$error":"#REF!"}},{"$f":"10-COUNTIF(#REF!,\"\")","v":{"$error":"#REF!"}},{"$f":"#REF!","v":{"$error":"#REF!"}},{"$f":"#REF!","v":{"$error":"#REF!"}},{"$f":"#REF!","v":{"$error":"#REF!"}},{"$f":"10-COUNTIF(#REF!,\"\")","v":{"$error":"#REF!"}},{"$f":"#REF!","v":{"$error":"#REF!"}},{"$f":"#REF!","v":{"$error":"#REF!"}},{"$f":"#REF!","v":{"$error":"#REF!"}},{"$f":"10-COUNTIF(#REF!,\"\")","v":{"$error":"#REF!"}},{"$f":"#REF!","v":{"$error":"#REF!"}},{"$f":"#REF!","v":{"$error":"#REF!"}},{"$f":"#REF!","v":{"$error":"#REF!"}},{"$f":"10-COUNTIF(#REF!,\"\")","v":{"$error":"#REF!"}},{"$f":"#REF!","v":{"$error":"#REF!"}},{"$f":"#REF!","v":{"$error":"#REF!"}},{"$f":"#REF!","v":{"$error":"#REF!"}},{"$f":"10-COUNTIF(#REF!,\"\")","v":{"$error":"#REF!"}},{"$f":"#REF!","v":{"$error":"#REF!"}},{"$f":"#REF!","v":{"$error":"#REF!"}},{"$f":"#REF!","v":{"$error":"#REF!"}},{"$f":"10-COUNTIF(#REF!,\"\")","v":{"$error":"#REF!"}},{"$f":"#REF!","v":{"$error":"#REF!"}}]
[null,null,{"$f":"Parametres!Q36","v":""},{"$f":"#REF!","v":{"$error":"#REF!"}},null,{"$f":"#REF!","v":{"$error":"#REF!"}},null,{"$f":"#REF!","v":{"$error":"#REF!"}},null,{"$f":"#REF!","v":{"$error":"#REF!"}},null,{"$f":"#REF!","v":{"$error":"#REF!"}},null,{"$f":"#REF!","v":{"$error":"#REF!"}},null,{"$f":"#REF!","v":{"$error":"#REF!"}},null,{"$f":"#REF!","v":{"$error":"#REF!"}},null,{"$f":"#REF!","v":{"$error":"#REF!"}},{"$f":"#REF!","v":{"$error":"#REF!"}},{"$f":"10-COUNTIF(#REF!,\"\")","v":{"$error":"#REF!"}},{"$f":"#REF!","v":{"$error":"#REF!"}},{"$f":"#REF!","v":{"$error":"#REF!"}},{"$f":"#REF!","v":{"$error":"#REF!"}},{"$f":"10-COUNTIF(#REF!,\"\")","v":{"$error":"#REF!"}},{"$f":"#REF!","v":{"$error":"#REF!"}},{"$f":"#REF!","v":{"$error":"#REF!"}},{"$f":"#REF!","v":{"$error":"#REF!"}},{"$f":"10-COUNTIF(#REF!,\"\")","v":{"$error":"#REF!"}},{"$f":"#REF!","v":{"$error":"#REF!"}},{"$f":"#REF!","v":{"$error":"#REF!"}},{"$f":"#REF!","v":{"$error":"#REF!"}},{"$f":"10-COUNTIF(#REF!,\"\")","v":{"$error":"#REF!"}},{"$f":"#REF!","v":{"$error":"#REF!"}},{"$f":"#REF!","v":{"$error":"#REF!"}},{"$f":"#REF!","v":{"$error":"#REF!"}},{"$f":"10-COUNTIF(#REF!,\"\")","v":{"$error":"#REF!"}},{"$f":"#REF!","v":{"$error":"#REF!"}},{"$f":"#REF!","v":{"$error":"#REF!"}},{"$f":"#REF!","v":{"$error":"#REF!"}},{"$f":"10-COUNTIF(#REF!,\"\")","v":{"$error":"#REF!"}},{"$f":"#REF!","v":{"$error":"#REF!"}},{"$f":"#REF!","v":{"$error":"#REF!"}},{"$f":"#REF!","v":{"$error":"#REF!"}},{"$f":"10-COUNTIF(#REF!,\"\")","v":{"$error":"#REF!"}},{"$f":"#REF!","v":{"$error":"#REF!"}},{"$f":"#REF!","v":{"$error":"#REF!"}},{"$f":"#REF!","v":{"$error":"#REF!"}},{"$f":"10-COUNTIF(#REF!,\"\")","v":{"$error":"#REF!"}},{"$f":"#REF!","v":{"$error":"#REF!"}},{"$f":"#REF!","v":{"$error":"#REF!"}},{"$f":"#REF!","v":{"$error":"#REF!"}},{"$f":"10-COUNTIF(#REF!,\"\")","v":{"$error":"#REF!"}},{"$f":"#REF!","v":{"$error":"#REF!"}},{"$f":"#REF!","v":{"$error":"#REF!"}},{"$f":"#REF!","v":{"$error":"#REF!"}},{"$f":"10-COUNTIF(#REF!,\"\")","v":{"$error":"#REF!"}},{"$f":"#REF!","v":{"$error":"#REF!"}},{"$f":"#REF!","v":{"$error":"#REF!"}},{"$f":"#REF!","v":{"$error":"#REF!"}},{"$f":"10-COUNTIF(#REF!,\"\")","v":{"$error":"#REF!"}},{"$f":"#REF!","v":{"$error":"#REF!"}},{"$f":"#REF!","v":{"$error":"#REF!"}},{"$f":"#REF!","v":{"$error":"#REF!"}},{"$f":"10-COUNTIF(#REF!,\"\")","v":{"$error":"#REF!"}},{"$f":"#REF!","v":{"$error":"#REF!"}}]
[null,null,{"$f":"Parametres!Q37","v":""},{"$f":"#REF!","v":{"$error":"#REF!"}},null,{"$f":"#REF!","v":{"$error":"#REF!"}},null,{"$f":"#REF!","v":{"$error":"#REF!"}},null,{"$f":"#REF!","v":{"$error":"#REF!"}},null,{"$f":"#REF!","v":{"$error":"#REF!"}},null,{"$f":"#REF!","v":{"$error":"#REF!"}},null,{"$f":"#REF!","v":{"$error":"#REF!"}},null,{"$f":"#REF!","v":{"$error":"#REF!"}},null,{"$f":"#REF!","v":{"$error":"#REF!"}},{"$f":"#REF!","v":{"$error":"#REF!"}},{"$f":"10-COUNTIF(#REF!,\"\")","v":{"$error":"#REF!"}},{"$f":"#REF!","v":{"$error":"#REF!"}},{"$f":"#REF!","v":{"$error":"#REF!"}},{"$f":"#REF!","v":{"$error":"#REF!"}},{"$f":"10-COUNTIF(#REF!,\"\")","v":{"$error":"#REF!"}},{"$f":"#REF!","v":{"$error":"#REF!"}},{"$f":"#REF!","v":{"$error":"#REF!"}},{"$f":"#REF!","v":{"$error":"#REF!"}},{"$f":"10-COUNTIF(#REF!,\"\")","v":{"$error":"#REF!"}},{"$f":"#REF!","v":{"$error":"#REF!"}},{"$f":"#REF!","v":{"$error":"#REF!"}},{"$f":"#REF!","v":{"$error":"#REF!"}},{"$f":"10-COUNTIF(#REF!,\"\")","v":{"$error":"#REF!"}},{"$f":"#REF!","v":{"$error":"#REF!"}},{"$f":"#REF!","v":{"$error":"#REF!"}},{"$f":"#REF!","v":{"$error":"#REF!"}},{"$f":"10-COUNTIF(#REF!,\"\")","v":{"$error":"#REF!"}},{"$f":"#REF!","v":{"$error":"#REF!"}},{"$f":"#REF!","v":{"$error":"#REF!"}},{"$f":"#REF!","v":{"$error":"#REF!"}},{"$f":"10-COUNTIF(#REF!,\"\")","v":{"$error":"#REF!"}},{"$f":"#REF!","v":{"$error":"#REF!"}},{"$f":"#REF!","v":{"$error":"#REF!"}},{"$f":"#REF!","v":{"$error":"#REF!"}},{"$f":"10-COUNTIF(#REF!,\"\")","v":{"$error":"#REF!"}},{"$f":"#REF!","v":{"$error":"#REF!"}},{"$f":"#REF!","v":{"$error":"#REF!"}},{"$f":"#REF!","v":{"$error":"#REF!"}},{"$f":"10-COUNTIF(#REF!,\"\")","v":{"$error":"#REF!"}},{"$f":"#REF!","v":{"$error":"#REF!"}},{"$f":"#REF!","v":{"$error":"#REF!"}},{"$f":"#REF!","v":{"$error":"#REF!"}},{"$f":"10-COUNTIF(#REF!,\"\")","v":{"$error":"#REF!"}},{"$f":"#REF!","v":{"$error":"#REF!"}},{"$f":"#REF!","v":{"$error":"#REF!"}},{"$f":"#REF!","v":{"$error":"#REF!"}},{"$f":"10-COUNTIF(#REF!,\"\")","v":{"$error":"#REF!"}},{"$f":"#REF!","v":{"$error":"#REF!"}},{"$f":"#REF!","v":{"$error":"#REF!"}},{"$f":"#REF!","v":{"$error":"#REF!"}},{"$f":"10-COUNTIF(#REF!,\"\")","v":{"$error":"#REF!"}},{"$f":"#REF!","v":{"$error":"#REF!"}},{"$f":"#REF!","v":{"$error":"#REF!"}},{"$f":"#REF!","v":{"$error":"#REF!"}},{"$f":"10-COUNTIF(#REF!,\"\")","v":{"$error":"#REF!"}},{"$f":"#REF!","v":{"$error":"#REF!"}}]
[null,null,{"$f":"Parametres!Q38","v":""},{"$f":"#REF!","v":{"$error":"#REF!"}},null,{"$f":"#REF!","v":{"$error":"#REF!"}},null,{"$f":"#REF!","v":{"$error":"#REF!"}},null,{"$f":"#REF!","v":{"$error":"#REF!"}},null,{"$f":"#REF!","v":{"$error":"#REF!"}},null,{"$f":"#REF!","v":{"$error":"#REF!"}},null,{"$f":"#REF!","v":{"$error":"#REF!"}},null,{"$f":"#REF!","v":{"$error":"#REF!"}},null,{"$f":"#REF!","v":{"$error":"#REF!"}},{"$f":"#REF!","v":{"$error":"#REF!"}},{"$f":"10-COUNTIF(#REF!,\"\")","v":{"$error":"#REF!"}},{"$f":"#REF!","v":{"$error":"#REF!"}},{"$f":"#REF!","v":{"$error":"#REF!"}},{"$f":"#REF!","v":{"$error":"#REF!"}},{"$f":"10-COUNTIF(#REF!,\"\")","v":{"$error":"#REF!"}},{"$f":"#REF!","v":{"$error":"#REF!"}},{"$f":"#REF!","v":{"$error":"#REF!"}},{"$f":"#REF!","v":{"$error":"#REF!"}},{"$f":"10-COUNTIF(#REF!,\"\")","v":{"$error":"#REF!"}},{"$f":"#REF!","v":{"$error":"#REF!"}},{"$f":"#REF!","v":{"$error":"#REF!"}},{"$f":"#REF!","v":{"$error":"#REF!"}},{"$f":"10-COUNTIF(#REF!,\"\")","v":{"$error":"#REF!"}},{"$f":"#REF!","v":{"$error":"#REF!"}},{"$f":"#REF!","v":{"$error":"#REF!"}},{"$f":"#REF!","v":{"$error":"#REF!"}},{"$f":"10-COUNTIF(#REF!,\"\")","v":{"$error":"#REF!"}},{"$f":"#REF!","v":{"$error":"#REF!"}},{"$f":"#REF!","v":{"$error":"#REF!"}},{"$f":"#REF!","v":{"$error":"#REF!"}},{"$f":"10-COUNTIF(#REF!,\"\")","v":{"$error":"#REF!"}},{"$f":"#REF!","v":{"$error":"#REF!"}},{"$f":"#REF!","v":{"$error":"#REF!"}},{"$f":"#REF!","v":{"$error":"#REF!"}},{"$f":"10-COUNTIF(#REF!,\"\")","v":{"$error":"#REF!"}},{"$f":"#REF!","v":{"$error":"#REF!"}},{"$f":"#REF!","v":{"$error":"#REF!"}},{"$f":"#REF!","v":{"$error":"#REF!"}},{"$f":"10-COUNTIF(#REF!,\"\")","v":{"$error":"#REF!"}},{"$f":"#REF!","v":{"$error":"#REF!"}},{"$f":"#REF!","v":{"$error":"#REF!"}},{"$f":"#REF!","v":{"$error":"#REF!"}},{"$f":"10-COUNTIF(#REF!,\"\")","v":{"$error":"#REF!"}},{"$f":"#REF!","v":{"$error":"#REF!"}},{"$f":"#REF!","v":{"$error":"#REF!"}},{"$f":"#REF!","v":{"$error":"#REF!"}},{"$f":"10-COUNTIF(#REF!,\"\")","v":{"$error":"#REF!"}},{"$f":"#REF!","v":{"$error":"#REF!"}},{"$f":"#REF!","v":{"$error":"#REF!"}},{"$f":"#REF!","v":{"$error":"#REF!"}},{"$f":"10-COUNTIF(#REF!,\"\")","v":{"$error":"#REF!"}},{"$f":"#REF!","v":{"$error":"#REF!"}},{"$f":"#REF!","v":{"$error":"#REF!"}},{"$f":"#REF!","v":{"$error":"#REF!"}},{"$f":"10-COUNTIF(#REF!,\"\")","v":{"$error":"#REF!"}},{"$f":"#REF!","v":{"$error":"#REF!"}}]

{"sheet":"Feuil1","index":5,"n_rows":260,"n_cols":59,"rows_kept":260,"cut":false,"hidden":false,"merged":[[30,36,30,37],[29,32,29,35],[28,32,28,35],[27,32,27,35],[26,32,26,35],[0,25,0,37],[0,18,0,24],[12,18,19,18],[4,21,4,32],[2,18,2,20],[2,21,2,31],[5,18,6,20],[5,21,6,32],[7,18,8,20],[9,18,10,20],[7,21,8,32],[9,21,10,32],[1,18,1,20],[1,21,1,31],[29,18,29,27],[28,18,28,27],[27,18,27,27],[26,18,26,27],[25,18,25,27],[24,18,24,27],[32,18,32,27],[33,18,33,27],[33,28,33,31],[32,28,32,31],[31,28,31,31],[29,28,29,31],[30,28,30,31],[28,28,28,31],[27,28,27,31],[26,28,26,31],[25,28,25,31],[25,38,25,41],[24,38,24,41],[29,36,29,37],[23,36,23,37],[28,36,28,37],[27,36,27,37],[26,36,26,37],[25,36,25,37],[24,36,24,37],[33,38,33,41],[32,38,32,41],[31,38,31,41],[30,38,30,41],[33,36,33,37],[32,36,32,37],[31,36,31,37],[22,18,22,41],[25,32,25,35],[23,32,23,35],[24,28,24,31],[23,18,23,31],[31,18,31,27],[30,18,30,27],[24,32,24,35],[33,32,33,35],[32,32,32,35],[31,32,31,35],[30,32,30,35],[29,38,29,41],[23,38,23,41],[28,38,28,41],[27,38,27,41],[26,38,26,41],[34,18,34,23],[35,18,35,23],[35,24,35,31],[34,24,34,31],[44,32,44,35],[44,36,44,37],[36,18,36,23],[44,38,44,41],[36,40,36,41],[35,34,35,35],[34,34,34,35],[36,38,36,39],[35,40,35,41],[34,40,34,41],[35,38,35,39],[34,38,34,39],[35,36,35,37],[34,36,34,37],[36,24,36,37],[35,32,35,33],[34,32,34,33],[42,17,42,41],[45,36,45,37],[45,38,45,41],[43,32,43,35],[43,36,43,37],[43,38,43,41],[43,18,43,31],[45,18,45,27],[44,18,44,27],[45,28,45,31],[44,28,44,31],[49,18,49,27],[48,18,48,27],[47,18,47,27],[46,18,46,27],[49,28,49,31],[48,28,48,31],[47,28,47,31],[46,28,46,31],[45,32,45,35],[48,32,48,35],[48,36,48,37],[48,38,48,41],[49,32,49,35],[49,36,49,37],[49,38,49,41],[46,32,46,35],[46,36,46,37],[46,38,46,41],[47,32,47,35],[47,36,47,37],[47,38,47,41],[50,32,50,35],[50,36,50,37],[50,38,50,41],[51,32,51,35],[51,36,51,37],[51,38,51,41],[53,18,53,27],[52,18,52,27],[51,18,51,27],[50,18,50,27],[53,28,53,31],[52,28,52,31],[51,28,51,31],[50,28,50,31],[55,18,55,23],[54,18,54,23],[55,24,55,31],[54,24,54,31],[52,32,52,35],[52,36,52,37],[52,38,52,41],[53,32,53,35],[53,36,53,37],[53,38,53,41],[54,38,54,39],[54,40,54,41],[55,32,55,33],[55,34,55,35],[55,36,55,37],[55,38,55,39],[55,40,55,41],[54,32,54,33],[54,34,54,35],[54,36,54,37],[63,32,63,35],[63,36,63,37],[63,38,63,41],[64,32,64,35],[64,36,64,37],[64,38,64,41],[56,38,56,39],[56,40,56,41],[56,18,56,23],[56,24,56,37],[62,17,62,41],[64,28,64,31],[64,18,64,27],[63,18,63,31],[68,28,68,31],[67,28,67,31],[66,28,66,31],[65,28,65,31],[68,18,68,27],[67,18,67,27],[66,18,66,27],[65,18,65,27],[69,32,69,35],[67,32,67,35],[67,36,67,37],[67,38,67,41],[68,32,68,35],[68,36,68,37],[68,38,68,41],[65,32,65,35],[65,36,65,37],[65,38,65,41],[66,32,66,35],[66,36,66,37],[66,38,66,41],[69,38,69,41],[70,32,70,35],[70,36,70,37],[70,38,70,41],[72,28,72,31],[71,28,71,31],[70,28,70,31],[69,28,69,31],[73,18,73,27],[70,18,70,27],[69,18,69,27],[69,36,69,37],[74,24,74,31],[74,18,74,23],[71,32,71,35],[71,36,71,37],[71,38,71,41],[72,32,72,35],[72,36,72,37],[72,38,72,41],[72,18,72,27],[71,18,71,27],[73,32,73,35],[73,36,73,37],[73,38,73,41],[74,32,74,33],[74,34,74,35],[74,36,74,37],[74,38,74,39],[74,40,74,41],[73,28,73,31],[75,38,75,39],[75,40,75,41],[76,38,76,39],[76,40,76,41],[75,32,75,33],[75,34,75,35],[75,36,75,37],[75,24,75,31],[75,18,75,23],[76,24,76,37],[76,18,76,23],[84,32,84,35],[84,36,84,37],[84,38,84,41],[85,32,85,35],[85,36,85,37],[85,38,85,41],[83,32,83,35],[83,36,83,37],[83,38,83,41],[88,32,88,35],[88,36,88,37],[88,38,88,41],[89,32,89,35],[89,36,89,37],[89,38,89,41],[86,32,86,35],[86,36,86,37],[86,38,86,41],[87,32,87,35],[87,36,87,37],[87,38,87,41],[92,38,92,41],[93,32,93,35],[93,36,93,37],[93,38,93,41],[90,32,90,35],[90,36,90,37],[90,38,90,41],[91,32,91,35],[91,36,91,37],[91,38,91,41],[96,38,96,39],[96,40,96,41],[96,18,96,23],[96,24,96,37],[102,0,102,41],[104,28,104,31],[104,18,104,27],[103,18,103,31],[94,38,94,39],[94,40,94,41],[95,32,95,33],[95,34,95,35],[95,36,95,37],[95,38,95,39],[95,40,95,41],[94,32,94,33],[94,34,94,35],[94,36,94,37],[94,24,94,31],[95,24,95,31],[95,18,95,23],[94,18,94,23],[103,32,103,35],[103,36,103,37],[103,38,103,41],[104,32,104,35],[104,36,104,37],[104,38,104,41],[107,36,107,37],[107,38,107,41],[108,32,108,35],[108,36,108,37],[108,38,108,41],[105,32,105,35],[105,36,105,37],[105,38,105,41],[106,32,106,35],[106,36,106,37],[106,38,106,41],[107,32,107,35],[108,28,108,31],[107,28,107,31],[111,32,111,35],[106,28,106,31],[105,28,105,31],[108,18,108,27],[107,18,107,27],[106,18,106,27],[105,18,105,27],[113,18,113,27],[114,18,114,23],[114,24,114,31],[111,36,111,37],[111,38,111,41],[112,32,112,35],[112,36,112,37],[112,38,112,41],[109,32,109,35],[109,36,109,37],[109,38,109,41],[110,32,110,35],[110,36,110,37],[110,38,110,41],[112,28,112,31],[111,28,111,31],[110,28,110,31],[109,28,109,31],[112,18,112,27],[111,18,111,27],[110,18,110,27],[109,18,109,27],[113,32,113,35],[113,36,113,37],[113,38,113,41],[114,32,114,33],[114,34,114,35],[114,36,114,37],[114,38,114,39],[114,40,114,41],[113,28,113,31],[115,38,115,39],[115,40,115,41],[116,38,116,39],[116,40,116,41],[115,32,115,33],[115,34,115,35],[115,36,115,37],[122,17,122,41],[123,18,123,31],[115,18,115,23],[115,24,115,31],[116,24,116,37],[116,18,116,23],[124,32,124,35],[124,36,124,37],[124,38,124,41],[125,32,125,35],[125,36,125,37],[125,38,125,41],[123,32,123,35],[123,36,123,37],[123,38,123,41],[133,32,133,35],[133,36,133,37],[133,38,133,41],[130,32,130,35],[130,36,130,37],[130,38,130,41],[131,32,131,35],[131,36,131,37],[131,38,131,41],[136,18,136,23],[144,28,144,31],[144,18,144,27],[143,18,143,31],[134,38,134,39],[134,40,134,41],[135,32,135,33],[135,34,135,35],[135,36,135,37],[135,38,135,39],[135,40,135,41],[134,32,134,33],[134,34,134,35],[134,36,134,37],[143,32,143,35],[143,36,143,37],[143,38,143,41],[144,32,144,35],[144,36,144,37],[144,38,144,41],[136,38,136,39],[136,40,136,41],[136,24,136,37],[135,24,135,31],[147,32,147,35],[147,36,147,37],[147,38,147,41],[148,32,148,35],[148,36,148,37],[148,38,148,41],[145,32,145,35],[145,36,145,37],[145,38,145,41],[146,32,146,35],[146,36,146,37],[146,38,146,41],[154,18,154,23],[151,32,151,35],[151,36,151,37],[151,38,151,41],[152,32,152,35],[152,36,152,37],[152,38,152,41],[149,32,149,35],[149,36,149,37],[149,38,149,41],[150,32,150,35],[150,36,150,37],[150,38,150,41],[153,32,153,35],[153,36,153,37],[153,38,153,41],[154,32,154,33],[154,34,154,35],[154,36,154,37],[154,38,154,39],[154,40,154,41],[154,24,154,31],[155,38,155,39],[155,40,155,41],[156,38,156,39],[156,40,156,41],[155,32,155,33],[155,34,155,35],[155,36,155,37],[156,24,156,37],[156,18,156,23],[155,24,155,31],[155,18,155,23],[164,32,164,35],[164,36,164,37],[164,38,164,41],[165,32,165,35],[165,36,165,37],[165,38,165,41],[163,32,163,35],[163,36,163,37],[163,38,163,41],[168,32,168,35],[168,36,168,37],[168,38,168,41],[169,32,169,35],[169,36,169,37],[169,38,169,41],[166,32,166,35],[166,36,166,37],[166,38,166,41],[167,32,167,35],[167,36,167,37],[167,38,167,41],[175,24,175,31],[175,18,175,23],[174,24,174,31],[174,18,174,23],[172,38,172,41],[173,32,173,35],[173,36,173,37],[173,38,173,41],[170,32,170,35],[170,36,170,37],[170,38,170,41],[171,32,171,35],[171,36,171,37],[171,38,171,41],[174,38,174,39],[174,40,174,41],[175,32,175,33],[175,34,175,35],[175,36,175,37],[175,38,175,39],[175,40,175,41],[174,32,174,33],[174,34,174,35],[174,36,174,37],[183,36,183,37],[183,38,183,41],[184,32,184,35],[184,36,184,37],[184,38,184,41],[176,38,176,39],[176,40,176,41],[176,24,176,37],[182,17,182,41],[176,18,176,23],[191,38,191,41],[192,32,192,35],[192,36,192,37],[192,38,192,41],[189,32,189,35],[189,36,189,37],[189,38,189,41],[190,32,190,35],[190,36,190,37],[190,38,190,41],[187,36,187,37],[187,38,187,41],[188,32,188,35],[188,36,188,37],[188,38,188,41],[185,32,185,35],[185,36,185,37],[185,38,185,41],[186,32,186,35],[186,36,186,37],[186,38,186,41],[193,36,193,37],[193,38,193,41],[194,32,194,33],[194,34,194,35],[194,36,194,37],[194,38,194,39],[194,40,194,41],[193,18,193,27],[193,28,193,31],[194,24,194,31],[194,18,194,23],[203,36,203,37],[203,38,203,41],[195,38,195,39],[195,40,195,41],[196,38,196,39],[196,40,196,41],[195,32,195,33],[195,34,195,35],[195,36,195,37],[196,24,196,37],[195,24,195,31],[206,36,206,37],[206,38,206,41],[207,32,207,35],[207,36,207,37],[207,38,207,41],[204,36,204,37],[204,38,204,41],[205,32,205,35],[205,36,205,37],[205,38,205,41],[208,36,208,37],[208,38,208,41],[209,32,209,35],[209,36,209,37],[209,38,209,41],[212,38,212,41],[213,32,213,35],[213,36,213,37],[213,38,213,41],[210,32,210,35],[210,36,210,37],[210,38,210,41],[211,32,211,35],[211,36,211,37],[211,38,211,41],[212,36,212,37],[225,28,225,31],[223,32,223,35],[223,36,223,37],[223,38,223,41],[224,32,224,35],[224,36,224,37],[224,38,224,41],[216,38,216,39],[216,40,216,41],[216,24,216,37],[222,17,222,41],[223,18,223,31],[216,18,216,23],[224,28,224,31],[215,24,215,31],[215,18,215,23],[214,24,214,31],[214,18,214,23],[214,38,214,39],[214,40,214,41],[215,32,215,33],[215,34,215,35],[215,36,215,37],[215,38,215,39],[215,40,215,41],[214,32,214,33],[214,34,214,35],[214,36,214,37],[227,32,227,35],[227,36,227,37],[227,38,227,41],[228,32,228,35],[228,36,228,37],[228,38,228,41],[225,32,225,35],[225,36,225,37],[225,38,225,41],[226,32,226,35],[226,36,226,37],[226,38,226,41],[231,38,231,41],[232,32,232,35],[232,36,232,37],[232,38,232,41],[229,32,229,35],[229,36,229,37],[229,38,229,41],[230,32,230,35],[230,36,230,37],[230,38,230,41],[236,18,236,23],[235,24,235,31],[235,18,235,23],[233,32,233,35],[233,36,233,37],[233,38,233,41],[234,32,234,33],[234,34,234,35],[234,36,234,37],[234,38,234,39],[234,40,234,41],[234,24,234,31],[234,18,234,23],[233,18,233,27],[233,28,233,31],[243,38,243,41],[235,38,235,39],[235,40,235,41],[236,38,236,39],[236,40,236,41],[235,32,235,33],[235,34,235,35],[235,36,235,37],[236,24,236,37],[246,38,246,41],[247,32,247,35],[247,36,247,37],[247,38,247,41],[244,32,244,35],[244,36,244,37],[244,38,244,41],[245,32,245,35],[245,36,245,37],[245,38,245,41],[250,38,250,41],[251,32,251,35],[251,36,251,37],[251,38,251,41],[248,32,248,35],[248,36,248,37],[248,38,248,41],[249,32,249,35],[249,36,249,37],[249,38,249,41],[256,18,256,23],[255,18,255,23],[254,18,254,23],[252,32,252,35],[252,36,252,37],[252,38,252,41],[253,32,253,35],[253,36,253,37],[253,38,253,41],[256,38,256,39],[256,40,256,41],[254,38,254,39],[254,40,254,41],[255,32,255,33],[255,34,255,35],[255,36,255,37],[255,38,255,39],[255,40,255,41],[254,32,254,33],[254,34,254,35],[254,36,254,37],[256,24,256,37],[255,24,255,31],[254,24,254,31],[82,0,82,42],[93,28,93,31],[92,28,92,31],[91,28,91,31],[90,28,90,31],[89,28,89,31],[88,28,88,31],[87,28,87,31],[86,28,86,31],[85,28,85,31],[84,28,84,31],[93,18,93,27],[92,18,92,27],[91,18,91,27],[90,18,90,27],[89,18,89,27],[88,18,88,27],[87,18,87,27],[86,18,86,27],[85,18,85,27],[84,18,84,27],[83,18,83,31],[92,32,92,35],[92,36,92,37],[132,18,132,27],[131,18,131,27],[130,18,130,27],[129,18,129,27],[128,18,128,27],[127,18,127,27],[126,18,126,27],[125,18,125,27],[124,18,124,27],[124,28,124,31],[132,32,132,35],[132,36,132,37],[132,38,132,41],[128,32,128,35],[128,36,128,37],[128,38,128,41],[129,32,129,35],[129,36,129,37],[129,38,129,41],[126,32,126,35],[126,36,126,37],[126,38,126,41],[132,28,132,31],[131,28,131,31],[130,28,130,31],[129,28,129,31],[128,28,128,31],[127,28,127,31],[126,28,126,31],[125,28,125,31],[127,32,127,35],[127,36,127,37],[127,38,127,41],[135,18,135,23],[134,24,134,31],[134,18,134,23],[133,18,133,27],[142,17,142,41],[153,28,153,31],[153,18,153,27],[152,28,152,31],[152,18,152,27],[151,28,151,31],[151,18,151,27],[150,28,150,31],[150,18,150,27],[149,28,149,31],[149,18,149,27],[148,28,148,31],[148,18,148,27],[147,28,147,31],[147,18,147,27],[146,28,146,31],[146,18,146,27],[145,28,145,31],[145,18,145,27],[133,28,133,31],[162,0,162,41],[173,28,173,31],[173,18,173,27],[172,28,172,31],[172,18,172,27],[171,28,171,31],[171,18,171,27],[170,28,170,31],[170,18,170,27],[169,28,169,31],[169,18,169,27],[168,28,168,31],[168,18,168,27],[167,28,167,31],[167,18,167,27],[166,28,166,31],[166,18,166,27],[165,28,165,31],[165,18,165,27],[164,28,164,31],[164,18,164,27],[163,18,163,31],[172,32,172,35],[172,36,172,37],[185,28,185,31],[185,18,185,27],[184,28,184,31],[184,18,184,27],[183,18,183,31],[191,28,191,31],[191,32,191,35],[191,18,191,27],[190,28,190,31],[190,18,190,27],[189,28,189,31],[189,18,189,27],[188,28,188,31],[188,18,188,27],[187,28,187,31],[187,18,187,27],[187,32,187,35],[183,32,183,35],[209,28,209,31],[208,28,208,31],[207,28,207,31],[206,28,206,31],[205,28,205,31],[204,28,204,31],[212,32,212,35],[186,28,186,31],[186,18,186,27],[208,32,208,35],[204,32,204,35],[196,18,196,23],[195,18,195,23],[193,32,193,35],[192,18,192,27],[192,28,192,31],[206,32,206,35],[203,32,203,35],[230,18,230,27],[229,18,229,27],[228,18,228,27],[227,18,227,27],[226,18,226,27],[225,18,225,27],[224,18,224,27],[191,36,191,37],[202,17,202,41],[213,18,213,27],[212,18,212,27],[211,18,211,27],[210,18,210,27],[209,18,209,27],[208,18,208,27],[207,18,207,27],[206,18,206,27],[205,18,205,27],[204,18,204,27],[203,18,203,31],[213,28,213,31],[212,28,212,31],[211,28,211,31],[210,28,210,31],[230,28,230,31],[229,28,229,31],[228,28,228,31],[227,28,227,31],[226,28,226,31],[242,17,242,41],[253,18,253,27],[252,18,252,27],[251,18,251,27],[250,18,250,27],[249,18,249,27],[248,18,248,27],[247,18,247,27],[246,18,246,27],[245,18,245,27],[244,18,244,27],[243,18,243,31],[253,28,253,31],[252,28,252,31],[251,28,251,31],[250,28,250,31],[249,28,249,31],[232,18,232,27],[231,18,231,27],[248,28,248,31],[247,28,247,31],[246,28,246,31],[245,28,245,31],[244,28,244,31],[250,32,250,35],[250,36,250,37],[232,28,232,31],[231,28,231,31],[246,32,246,35],[246,36,246,37],[243,32,243,35],[243,36,243,37],[231,32,231,35],[231,36,231,37]]}
["Classe :","Nom","Critère Fixe 1","Critère Fixe 2","Critère 1","Critère 2","Critère 3","Critère 4","Critère 5","Critère 6","Critère 7","Critère 8","Critère 9","Critère 10","Critère 11","Critère 12","Critère 13",null,"<< Retour",null,null,null,null,null,null,{"$f":"IF(Réglages!B53=\"\",\"\",Réglages!B53)","v":"APSA"},null,null,null,null,null,null,null,null,null,null,null,null,null,null,null,null,null,null,null,null,null,null,null,null,{"$f":"IF($AC$25=$AZ$10,$AZ$11:$AZ$20,IF($AC$25=$BA$10,$BA$11:$BA$20,IF($AC$25=$BB$10,$BB$11:$BB$20,IF($AC$25=$BC$10,$BC$11:$BC$20,IF($AC$25=$BD$10,$BD$11:$BD$20,IF($AC$25=$BE$10,$BE$11:$BE$20,IF($AC$25=$BF$10,$BF$11:$BF$20,IF(AC25=BG10,BG11:BG20,BH20))))))))","v":0}]
[null,null,null,null,null,null,null,null,null,null,null,null,null,null,null,null,null,null,"Classe : ",null,null,{"$f":"Parametres!C2","v":"Classe Test"},null,null,null,null,null,null,null,null,null,null,"Code"]
[null,null,null,null,null,null,null,null,null,null,null,null,null,null,null,null,null,null,"Prénom :",null,null,{"$f":"Synthèse!C6","v":"Elève 1"},null,null,null,null,null,null,null,null,null,null,{"$f":"AG4","v":555}]
[null,null,null,null,null,null,null,null,null,null,null,null,null,null,null,null,null,null,null,null,null,null,null,null,null,null,null,null,null,null,null,null,{"$f":"Synthèse!B6","v":555},"Axes",{"$f":"IF(Réglages!$B$8=\"\",\"\",Réglages!$B$8)","v":"Le serveur "},{"$f":"IF(Réglages!$C$8=\"\",\"\",Réglages!$C$8)","v":"Observateur"},{"$f":"IF(Réglages!$D$8=\"\",\"\",Réglages!$D$8)","v":"?"},{"$f":"IF(Réglages!$E$8=\"\",\"\",Réglages!$E$8)","v":""},{"$f":"IF(Réglages!$F$8=\"\",\"\",Réglages!$F$8)","v":""},{"$f":"IF(Réglages!$G$8=\"\",\"\",Réglages!$G$8)","v":""},{"$f":"IF(Réglages!$H$8=\"\",\"\",Réglages!$H$8)","v":""},{"$f":"IF(Réglages!$I$8=\"\",\"\",Réglages!$I$8)","v":""},null,null,null,null,null,null,null,null,"Nbre d'axes",{"$f":"Réglages!X5","v":3}]
[null,null,null,null,null,null,null,null,null,null,null,null,null,null,null,null,null,null,{"$f":"Réglages!$B$54","v":"Rappel"},null,null,"Axe 1 ",null,null,null,null,null,null,null,null,null,null,null,"Prof",{"$f":"Synthèse!E6","v":0},{"$f":"Synthèse!G6","v":0},{"$f":"Synthèse!I6","v":0},{"$f":"Synthèse!K6","v":0},{"$f":"Synthèse!M6","v":0},{"$f":"Synthèse!O6","v":0},{"$f":"Synthèse!Q6","v":0},{"$f":"Synthèse!S6","v":0},null,null,null,null,null,null,null,null,"Nom du Radar",{"$f":"Réglages!B51","v":"Progrès "}]
[null,null,null,null,null,null,null,null,null,null,null,null,null,null,null,null,null,null,{"$f":"Réglages!$D$50","v":"Définition"},null,null,{"$f":"IF($V$5=Réglages!$P$4,Réglages!$P$5,IF($V$5=Réglages!$Q$4,Réglages!$Q$5,IF($V$5=Réglages!$R$4,Réglages!$R$5,IF($V$5=Réglages!$S$4,Réglages!$S$5,IF($V$5=Réglages!$T$4,Réglages!$T$5,IF($V$5=Réglages!$U$4,Réglages!$U$5,IF($V$5=Réglages!$V$4,Réglages!$V$5,IF($V$5=Réglages!$W$4,Réglages!$W$5,\"\"))))))))","v":"Le serveur "},null,null,null,null,null,null,null,null,null,null,null,"Moi",{"$f":"INDEX(AI7:AI18, MAX(IF(AI8:AI18<>0, ROW(AI8:AI18)-ROW(AI8)+1, 0)))","v":0},{"$f":"INDEX(AJ7:AJ18, MAX(IF(AJ7:AJ18<>0, ROW(AJ7:AJ18)-ROW(AJ7)+1, 0)))","v":0},{"$f":"INDEX(AK7:AK18, MAX(IF(AK7:AK18<>0, ROW(AK7:AK18)-ROW(AK7)+1, 0)))","v":0},{"$f":"INDEX(AL7:AL18, MAX(IF(AL7:AL18<>0, ROW(AL7:AL18)-ROW(AL7)+1, 0)))","v":0},{"$f":"INDEX(AM7:AM18, MAX(IF(AM7:AM18<>0, ROW(AM7:AM18)-ROW(AM7)+1, 0)))","v":0},{"$f":"INDEX(AN7:AN18, MAX(IF(AN7:AN18<>0, ROW(AN7:AN18)-ROW(AN7)+1, 0)))","v":0},{"$f":"INDEX(AO7:AO18, MAX(IF(AO7:AO18<>0, ROW(AO7:AO18)-ROW(AO7)+1, 0)))","v":0},{"$f":"INDEX(AP7:AP18, MAX(IF(AP7:AP18<>0, ROW(AP7:AP18)-ROW(AP7)+1, 0)))","v":0},null,null,null,null,null,null,null,null,"Nombre de leçon",{"$f":"Réglages!E57","v":12}]
[null,null,null,null,null,null,null,null,null,null,null,null,null,null,null,null,null,null,null,null,null,null,null,null,null,null,null,null,null,null,null,null,null,{"$f":"IF($AZ$6>=1,\"L1\",\"\")","v":"L1"},{"$f":"IF($Y$35=AZ$8,$AO$35,IF($Y$36=AZ$8,$AO$36,0))","v":0},0,0,0,0,0,0,0]
[null,null,null,null,null,null,null,null,null,null,null,null,null,null,null,null,null,null,{"$f":"Réglages!$D$51","v":"Enjeu"},null,null,{"$f":"IF($V$5=Réglages!$P$4,Réglages!$P$6,IF($V$5=Réglages!$Q$4,Réglages!Q6,IF($V$5=Réglages!$R$4,Réglages!R6,IF($V$5=Réglages!$S$4,Réglages!S6,IF($V$5=Réglages!$T$4,Réglages!T6,IF($V$5=Réglages!$U$4,Réglages!U6,IF($V$5=Réglages!$V$4,Réglages!V6,IF($V$5=Réglages!$W$4,Réglages!W6,\"\"))))))))","v":"Moteur "},null,null,null,null,null,null,null,null,null,null,null,{"$f":"IF($AZ$6>=2,\"L2\",\"\")","v":"L2"},{"$f":"IF($Y$55=AZ$8,$AO$55,IF($Y$56=AZ$8,$AO$56,0))","v":0},0,0,0,0,0,0,0,null,null,null,null,null,null,null,null,null,{"$f":"Réglages!Z1","v":"Le serveur "},{"$f":"Réglages!AA1","v":"Observateur"},{"$f":"Réglages!AB1","v":"?"},{"$f":"Réglages!AC1","v":""},{"$f":"Réglages!AD1","v":""},{"$f":"Réglages!AE1","v":""},{"$f":"Réglages!AF1","v":""},{"$f":"Réglages!AG1","v":""}]
[null,null,null,null,null,null,null,null,null,null,null,null,null,null,null,null,null,null,null,null,null,null,null,null,null,null,null,null,null,null,null,null,null,{"$f":"IF($AZ$6>=3,\"L3\",\"\")","v":"L3"},{"$f":"IF($Y$75=AZ$8,$AO$75,IF($Y$76=AZ$8,$AO$76,0))","v":0},0,0,0,0,0,0,0,null,null,null,null,null,null,null,null,null,{"$f":"IF(Réglages!P6=\"\",\"\",Réglages!P6)","v":"Moteur "},{"$f":"IF(Réglages!Q6=\"\",\"\",Réglages!Q6)","v":"Non moteur"},{"$f":"IF(Réglages!R6=\"\",\"\",Réglages!R6)","v":"Quel enjeu ?"},{"$f":"IF(Réglages!S6=\"\",\"\",Réglages!S6)","v":""},{"$f":"IF(Réglages!T6=\"\",\"\",Réglages!T6)","v":""},{"$f":"IF(Réglages!U6=\"\",\"\",Réglages!U6)","v":""},{"$f":"IF(Réglages!V6=\"\",\"\",Réglages!V6)","v":""},{"$f":"IF(Réglages!W6=\"\",\"\",Réglages!W6)","v":""}]
[null,null,null,null,null,null,null,null,null,null,null,null,null,null,null,null,null,null,{"$f":"IF(V8=Réglages!L5,Réglages!D52,Réglages!D53)","v":"Sit de Réf"},null,null,{"$f":"IF($V$5=Réglages!$P$4,Réglages!$P$7,IF($V$5=Réglages!$Q$4,Réglages!$Q$7,IF($V$5=Réglages!$R$4,Réglages!$R$7,IF($V$5=Réglages!$S$4,Réglages!$S$7,IF($V$5=Réglages!$T$4,Réglages!$T$7,IF($V$5=Réglages!$U$4,Réglages!$U$7,IF($V$5=Réglages!$V$4,Réglages!$V$7,IF($V$5=Réglages!$W$4,Réglages!$W$7,\"\"))))))))","v":"Le sablier"},null,null,null,null,null,null,null,null,null,null,null,{"$f":"IF($AZ$6>=4,\"L4\",\"\")","v":"L4"},{"$f":"IF($Y$95=AZ$8,$AO$95,IF($Y$96=AZ$8,$AO$96,0))","v":0},0,0,0,0,0,0,0,null,null,null,null,null,null,null,null,null,"Axe 1","Axe 2","Axe 3","Axe 4","Axe 5","Axe 6","Axe 7","Axe 8"]
[null,null,null,null,null,null,null,null,null,null,null,null,null,null,null,null,null,null,null,null,null,null,null,null,null,null,null,null,null,null,null,null,null,{"$f":"IF($AZ$6>=5,\"L5\",\"\")","v":"L5"},{"$f":"IF($Y$115=AZ$8,$AO$115,IF($Y$116=AZ$8,$AO$116,0))","v":0},0,0,0,0,0,0,0]
[null,null,null,null,null,null,null,null,null,null,null,null,null,null,null,null,null,null,null,null,null,null,null,null,null,null,null,null,null,null,null,null,null,{"$f":"IF($AZ$6>=6,\"L6\",\"\")","v":"L6"},{"$f":"IF($Y$135=AZ$8,$AO$135,IF($Y$136=AZ$8,$AO$136,0))","v":0},0,0,0,0,0,0,0,null,null,null,null,null,null,null,null,null,{"$f":"IF(Réglages!Z3=\"\",\"\",\"1 / \"&Réglages!Z3)","v":"1 / exemple : sit niv1"},{"$f":"IF(Réglages!AA3=\"\",\"\",\"1 / \"&Réglages!AA3)","v":"1 / exemple : sit niv1"},{"$f":"IF(Réglages!AB3=\"\",\"\",\"1 / \"&Réglages!AB3)","v":""},{"$f":"IF(Réglages!AC3=\"\",\"\",\"1 / \"&Réglages!AC3)","v":""},{"$f":"IF(Réglages!AD3=\"\",\"\",\"1 / \"&Réglages!AD3)","v":""},{"$f":"IF(Réglages!AE3=\"\",\"\",\"1 / \"&Réglages!AE3)","v":""},{"$f":"IF(Réglages!AF3=\"\",\"\",\"1 / \"&Réglages!AF3)","v":""},{"$f":"IF(Réglages!AG3=\"\",\"\",\"1 / \"&Réglages!AG3)","v":""}]
[null,null,null,null,null,null,null,null,null,null,null,null,null,null,null,null,null,null,{"$f":"Réglages!H54","v":"Mes progrès"},null,null,null,null,null,null,null,null,null,null,null,null,null,null,{"$f":"IF($AZ$6>=7,\"L7\",\"\")","v":"L7"},{"$f":"IF($Y$155=AZ$8,$AO$155,IF($Y$156=AZ$8,$AO$156,0))","v":0},0,0,0,0,0,0,0,null,null,null,null,null,null,null,null,null,{"$f":"IF(Réglages!Z4=\"\",\"\",\"2 / \"&Réglages!Z4)","v":"2 / exemple : sit niv2"},{"$f":"IF(Réglages!AA4=\"\",\"\",\"2 / \"&Réglages!AA4)","v":"2 / exemple : sit niv2"},{"$f":"IF(Réglages!AB4=\"\",\"\",\"2 / \"&Réglages!AB4)","v":""},{"$f":"IF(Réglages!AC4=\"\",\"\",\"2 / \"&Réglages!AC4)","v":""},{"$f":"IF(Réglages!AD4=\"\",\"\",\"2 / \"&Réglages!AD4)","v":""},{"$f":"IF(Réglages!AE4=\"\",\"\",\"2 / \"&Réglages!AE4)","v":""},{"$f":"IF(Réglages!AF4=\"\",\"\",\"2 / \"&Réglages!AF4)","v":""},{"$f":"IF(Réglages!AG4=\"\",\"\",\"2 / \"&Réglages!AG4)","v":""}]
[null,null,null,null,null,null,null,null,null,null,null,null,null,null,null,null,null,null,null,null,null,null,null,null,null,null,null,null,null,null,null,null,null,{"$f":"IF($AZ$6>=8,\"L8\",\"\")","v":"L8"},{"$f":"IF($Y$175=AZ$8,$AO$175,IF($Y$176=AZ$8,$AO$176,0))","v":0},0,0,0,0,0,0,0,null,null,null,null,null,null,null,null,null,{"$f":"IF(Réglages!Z5=\"\",\"\",\"3 / \"&Réglages!Z5)","v":"3 / sit3"},{"$f":"IF(Réglages!AA5=\"\",\"\",\"3 / \"&Réglages!AA5)","v":"3 / sit3"},{"$f":"IF(Réglages!AB5=\"\",\"\",\"3 / \"&Réglages!AB5)","v":""},{"$f":"IF(Réglages!AC5=\"\",\"\",\"3 / \"&Réglages!AC5)","v":""},{"$f":"IF(Réglages!AD5=\"\",\"\",\"3 / \"&Réglages!AD5)","v":""},{"$f":"IF(Réglages!AE5=\"\",\"\",\"3 / \"&Réglages!AE5)","v":""},{"$f":"IF(Réglages!AF5=\"\",\"\",\"3 / \"&Réglages!AF5)","v":""},{"$f":"IF(Réglages!AG5=\"\",\"\",\"3 / \"&Réglages!AG5)","v":""}]
[null,null,null,null,null,null,null,null,null,null,null,null,null,null,null,null,null,null,null,null,null,null,null,null,null,null,null,null,null,null,null,null,null,{"$f":"IF($AZ$6>=9,\"L9\",\"\")","v":"L9"},{"$f":"IF($Y$195=AZ$8,$AO$195,IF($Y$196=AZ$8,$AO$196,0))","v":0},0,0,0,0,0,0,0,null,null,null,null,null,null,null,null,null,{"$f":"IF(Réglages!Z6=\"\",\"\",\"4 / \"&Réglages!Z6)","v":"4 / sit4"},{"$f":"IF(Réglages!AA6=\"\",\"\",\"4 / \"&Réglages!AA6)","v":"4 / sit4"},{"$f":"IF(Réglages!AB6=\"\",\"\",\"4 / \"&Réglages!AB6)","v":""},{"$f":"IF(Réglages!AC6=\"\",\"\",\"4 / \"&Réglages!AC6)","v":""},{"$f":"IF(Réglages!AD6=\"\",\"\",\"4 / \"&Réglages!AD6)","v":""},{"$f":"IF(Réglages!AE6=\"\",\"\",\"4 / \"&Réglages!AE6)","v":""},{"$f":"IF(Réglages!AF6=\"\",\"\",\"4 / \"&Réglages!AF6)","v":""},{"$f":"IF(Réglages!AG6=\"\",\"\",\"4 / \"&Réglages!AG6)","v":""}]
[null,null,null,null,null,null,null,null,null,null,null,null,null,null,null,null,null,null,null,null,null,null,null,null,null,null,null,null,null,null,null,null,null,{"$f":"IF($AZ$6>=10,\"L10\",\"\")","v":"L10"},{"$f":"IF($Y$215=AZ$8,$AO$215,IF($Y$216=AZ$8,$AO$216,0))","v":0},0,0,0,0,0,0,0,null,null,null,null,null,null,null,null,null,{"$f":"IF(Réglages!Z7=\"\",\"\",\"5 / \"&Réglages!Z7)","v":"5 / sit5"},{"$f":"IF(Réglages!AA7=\"\",\"\",\"5 / \"&Réglages!AA7)","v":"5 / sit5"},{"$f":"IF(Réglages!AB7=\"\",\"\",\"5 / \"&Réglages!AB7)","v":""},{"$f":"IF(Réglages!AC7=\"\",\"\",\"5 / \"&Réglages!AC7)","v":""},{"$f":"IF(Réglages!AD7=\"\",\"\",\"5 / \"&Réglages!AD7)","v":""},{"$f":"IF(Réglages!AE7=\"\",\"\",\"5 / \"&Réglages!AE7)","v":""},{"$f":"IF(Réglages!AF7=\"\",\"\",\"5 / \"&Réglages!AF7)","v":""},{"$f":"IF(Réglages!AG7=\"\",\"\",\"5 / \"&Réglages!AG7)","v":""}]
[null,null,null,null,null,null,null,null,null,null,null,null,null,null,null,null,null,null,null,null,null,null,null,null,null,null,null,null,null,null,null,null,null,{"$f":"IF($AZ$6>=11,\"L11\",\"\")","v":"L11"},{"$f":"IF($Y$235=AZ$8,$AO$235,IF($Y$236=AZ$8,$AO$236,0))","v":0},0,0,0,0,0,0,0,null,null,null,null,null,null,null,null,null,{"$f":"IF(Réglages!Z8=\"\",\"\",\"6 / \"&Réglages!Z8)","v":""},{"$f":"IF(Réglages!AA8=\"\",\"\",\"6 / \"&Réglages!AA8)","v":""},{"$f":"IF(Réglages!AB8=\"\",\"\",\"6 / \"&Réglages!AB8)","v":""},{"$f":"IF(Réglages!AC8=\"\",\"\",\"6 / \"&Réglages!AC8)","v":""},{"$f":"IF(Réglages!AD8=\"\",\"\",\"6 / \"&Réglages!AD8)","v":""},{"$f":"IF(Réglages!AE8=\"\",\"\",\"6 / \"&Réglages!AE8)","v":""},{"$f":"IF(Réglages!AF8=\"\",\"\",\"6 / \"&Réglages!AF8)","v":""},{"$f":"IF(Réglages!AG8=\"\",\"\",\"6 / \"&Réglages!AG8)","v":""}]
[null,null,null,null,null,null,null,null,null,null,null,null,null,null,null,null,null,null,null,null,null,null,null,null,null,null,null,null,null,null,null,null,null,{"$f":"IF($AZ$6>=12,\"L12\",\"\")","v":"L12"},{"$f":"IF($Y$255=AZ$8,$AO$255,IF($Y$256=AZ$8,$AO$256,0))","v":0},0,0,0,0,0,0,0,null,null,null,null,null,null,null,null,null,{"$f":"IF(Réglages!Z9=\"\",\"\",\"7 / \"&Réglages!Z9)","v":""},{"$f":"IF(Réglages!AA9=\"\",\"\",\"7 / \"&Réglages!AA9)","v":""},{"$f":"IF(Réglages!AB9=\"\",\"\",\"7 / \"&Réglages!AB9)","v":""},{"$f":"IF(Réglages!AC9=\"\",\"\",\"7 / \"&Réglages!AC9)","v":""},{"$f":"IF(Réglages!AD9=\"\",\"\",\"7 / \"&Réglages!AD9)","v":""},{"$f":"IF(Réglages!AE9=\"\",\"\",\"7 / \"&Réglages!AE9)","v":""},{"$f":"IF(Réglages!AF9=\"\",\"\",\"7 / \"&Réglages!AF9)","v":""},{"$f":"IF(Réglages!AG9=\"\",\"\",\"7 / \"&Réglages!AG9)","v":""}]
[null,null,null,null,null,null,null,null,null,null,null,null,null,null,null,null,null,null,null,null,null,null,null,null,null,null,null,null,null,null,null,null,null,null,null,null,null,null,null,null,null,null,null,null,null,null,null,null,null,null,null,{"$f":"IF(Réglages!Z10=\"\",\"\",\"8 / \"&Réglages!Z10)","v":""},{"$f":"IF(Réglages!AA10=\"\",\"\",\"8 / \"&Réglages!AA10)","v":""},{"$f":"IF(Réglages!AB10=\"\",\"\",\"8 / \"&Réglages!AB10)","v":""},{"$f":"IF(Réglages!AC10=\"\",\"\",\"8 / \"&Réglages!AC10)","v":""},{"$f":"IF(Réglages!AD10=\"\",\"\",\"8 / \"&Réglages!AD10)","v":""},{"$f":"IF(Réglages!AE10=\"\",\"\",\"8 / \"&Réglages!AE10)","v":""},{"$f":"IF(Réglages!AF10=\"\",\"\",\"8 / \"&Réglages!AF10)","v":""},{"$f":"IF(Réglages!AG10=\"\",\"\",\"8 / \"&Réglages!AG10)","v":""}]
[null,null,null,null,null,null,null,null,null,null,null,null,null,null,null,null,null,null,null,{"$f":"IF($V$5=Réglages!$B$6,Feuil1!$AI7,IF($V$5=Réglages!$C$6,Feuil1!$AJ7,IF($V$5=Réglages!$D$6,Feuil1!$AK7,IF($V$5=Réglages!$E$6,Feuil1!$AL7,IF($V$5=Réglages!$F$6,Feuil1!$AM7,IF($V$5=Réglages!$G$6,Feuil1!$AN7,IF($V$5=Réglages!$H$6,Feuil1!$AO7,IF($V$5=Réglages!$I$6,Feuil1!$AP7,IF($V$5=Réglages!$I$6,Feuil1!$AQ7,\"\")))))))))","v":0},{"$f":"IF($V$5=Réglages!$B$6,Feuil1!$AI8,IF($V$5=Réglages!$C$6,Feuil1!$AJ8,IF($V$5=Réglages!$D$6,Feuil1!$AK8,IF($V$5=Réglages!$E$6,Feuil1!$AL8,IF($V$5=Réglages!$F$6,Feuil1!$AM8,IF($V$5=Réglages!$G$6,Feuil1!$AN8,IF($V$5=Réglages!$H$6,Feuil1!$AO8,IF($V$5=Réglages!$I$6,Feuil1!$AP8,IF($V$5=Réglages!$I$6,Feuil1!$AQ8,\"\")))))))))","v":0},{"$f":"IF($V$5=Réglages!$B$6,Feuil1!$AI9,IF($V$5=Réglages!$C$6,Feuil1!$AJ9,IF($V$5=Réglages!$D$6,Feuil1!$AK9,IF($V$5=Réglages!$E$6,Feuil1!$AL9,IF($V$5=Réglages!$F$6,Feuil1!$AM9,IF($V$5=Réglages!$G$6,Feuil1!$AN9,IF($V$5=Réglages!$H$6,Feuil1!$AO9,IF($V$5=Réglages!$I$6,Feuil1!$AP9,IF($V$5=Réglages!$I$6,Feuil1!$AQ9,\"\")))))))))","v":0},{"$f":"IF($V$5=Réglages!$B$6,Feuil1!$AI10,IF($V$5=Réglages!$C$6,Feuil1!$AJ10,IF($V$5=Réglages!$D$6,Feuil1!$AK10,IF($V$5=Réglages!$E$6,Feuil1!$AL10,IF($V$5=Réglages!$F$6,Feuil1!$AM10,IF($V$5=Réglages!$G$6,Feuil1!$AN10,IF($V$5=Réglages!$H$6,Feuil1!$AO10,IF($V$5=Réglages!$I$6,Feuil1!$AP10,IF($V$5=Réglages!$I$6,Feuil1!$AQ10,\"\")))))))))","v":0},{"$f":"IF($V$5=Réglages!$B$6,Feuil1!$AI11,IF($V$5=Réglages!$C$6,Feuil1!$AJ11,IF($V$5=Réglages!$D$6,Feuil1!$AK11,IF($V$5=Réglages!$E$6,Feuil1!$AL11,IF($V$5=Réglages!$F$6,Feuil1!$AM11,IF($V$5=Réglages!$G$6,Feuil1!$AN11,IF($V$5=Réglages!$H$6,Feuil1!$AO11,IF($V$5=Réglages!$I$6,Feuil1!$AP11,IF($V$5=Réglages!$I$6,Feuil1!$AQ11,\"\")))))))))","v":0},{"$f":"IF($V$5=Réglages!$B$6,Feuil1!$AI12,IF($V$5=Réglages!$C$6,Feuil1!$AJ12,IF($V$5=Réglages!$D$6,Feuil1!$AK12,IF($V$5=Réglages!$E$6,Feuil1!$AL12,IF($V$5=Réglages!$F$6,Feuil1!$AM12,IF($V$5=Réglages!$G$6,Feuil1!$AN12,IF($V$5=Réglages!$H$6,Feuil1!$AO12,IF($V$5=Réglages!$I$6,Feuil1!$AP12,IF($V$5=Réglages!$I$6,Feuil1!$AQ12,\"\")))))))))","v":0},{"$f":"IF($V$5=Réglages!$B$6,Feuil1!$AI13,IF($V$5=Réglages!$C$6,Feuil1!$AJ13,IF($V$5=Réglages!$D$6,Feuil1!$AK13,IF($V$5=Réglages!$E$6,Feuil1!$AL13,IF($V$5=Réglages!$F$6,Feuil1!$AM13,IF($V$5=Réglages!$G$6,Feuil1!$AN13,IF($V$5=Réglages!$H$6,Feuil1!$AO13,IF($V$5=Réglages!$I$6,Feuil1!$AP13,IF($V$5=Réglages!$I$6,Feuil1!$AQ13,\"\")))))))))","v":0},{"$f":"IF($V$5=Réglages!$B$6,Feuil1!$AI14,IF($V$5=Réglages!$C$6,Feuil1!$AJ14,IF($V$5=Réglages!$D$6,Feuil1!$AK14,IF($V$5=Réglages!$E$6,Feuil1!$AL14,IF($V$5=Réglages!$F$6,Feuil1!$AM14,IF($V$5=Réglages!$G$6,Feuil1!$AN14,IF($V$5=Réglages!$H$6,Feuil1!$AO14,IF($V$5=Réglages!$I$6,Feuil1!$AP14,IF($V$5=Réglages!$I$6,Feuil1!$AQ14,\"\")))))))))","v":0},{"$f":"IF($V$5=Réglages!$B$6,Feuil1!$AI15,IF($V$5=Réglages!$C$6,Feuil1!$AJ15,IF($V$5=Réglages!$D$6,Feuil1!$AK15,IF($V$5=Réglages!$E$6,Feuil1!$AL15,IF($V$5=Réglages!$F$6,Feuil1!$AM15,IF($V$5=Réglages!$G$6,Feuil1!$AN15,IF($V$5=Réglages!$H$6,Feuil1!$AO15,IF($V$5=Réglages!$I$6,Feuil1!$AP15,IF($V$5=Réglages!$I$6,Feuil1!$AQ15,\"\")))))))))","v":0},{"$f":"IF($V$5=Réglages!$B$6,Feuil1!$AI16,IF($V$5=Réglages!$C$6,Feuil1!$AJ16,IF($V$5=Réglages!$D$6,Feuil1!$AK16,IF($V$5=Réglages!$E$6,Feuil1!$AL16,IF($V$5=Réglages!$F$6,Feuil1!$AM16,IF($V$5=Réglages!$G$6,Feuil1!$AN16,IF($V$5=Réglages!$H$6,Feuil1!$AO16,IF($V$5=Réglages!$I$6,Feuil1!$AP16,IF($V$5=Réglages!$I$6,Feuil1!$AQ16,\"\")))))))))","v":0},{"$f":"IF($V$5=Réglages!$B$6,Feuil1!$AI17,IF($V$5=Réglages!$C$6,Feuil1!$AJ17,IF($V$5=Réglages!$D$6,Feuil1!$AK17,IF($V$5=Réglages!$E$6,Feuil1!$AL17,IF($V$5=Réglages!$F$6,Feuil1!$AM17,IF($V$5=Réglages!$G$6,Feuil1!$AN17,IF($V$5=Réglages!$H$6,Feuil1!$AO17,IF($V$5=Réglages!$I$6,Feuil1!$AP17,IF($V$5=Réglages!$I$6,Feuil1!$AQ17,\"\")))))))))","v":0},{"$f":"IF($V$5=Réglages!$B$6,Feuil1!$AI18,IF($V$5=Réglages!$C$6,Feuil1!$AJ18,IF($V$5=Réglages!$D$6,Feuil1!$AK18,IF($V$5=Réglages!$E$6,Feuil1!$AL18,IF($V$5=Réglages!$F$6,Feuil1!$AM18,IF($V$5=Réglages!$G$6,Feuil1!$AN18,IF($V$5=Réglages!$H$6,Feuil1!$AO18,IF($V$5=Réglages!$I$6,Feuil1!$AP18,IF($V$5=Réglages!$I$6,Feuil1!$AQ18,\"\")))))))))","v":0},{"$f":"IF($V$5=Réglages!$B$6,Feuil1!$AI6,IF($V$5=Réglages!$C$6,Feuil1!$AJ6,IF($V$5=Réglages!$D$6,Feuil1!$AK6,IF($V$5=Réglages!$E$6,Feuil1!$AL6,IF($V$5=Réglages!$F$6,Feuil1!$AM6,IF($V$5=Réglages!$G$6,Feuil1!$AN6,IF($V$5=Réglages!$H$6,Feuil1!$AO6,IF($V$5=Réglages!$I$6,Feuil1!$AP6,IF($V$5=Réglages!$I$6,Feuil1!$AQ6,\"\")))))))))","v":0},{"$f":"IF($V$5=Réglages!$B$6,Feuil1!$AI5,IF($V$5=Réglages!$C$6,Feuil1!$AJ5,IF($V$5=Réglages!$D$6,Feuil1!$AK5,IF($V$5=Réglages!$E$6,Feuil1!$AL5,IF($V$5=Réglages!$F$6,Feuil1!$AM5,IF($V$5=Réglages!$G$6,Feuil1!$AN5,IF($V$5=Réglages!$H$6,Feuil1!$AO5,IF($V$5=Réglages!$I$6,Feuil1!$AP5,IF($V$5=Réglages!$I$6,Feuil1!$AQ5,\"\")))))))))","v":0},null,null,null,null,null,null,null,null,null,null,null,null,null,null,null,null,null,null,{"$f":"IF(Réglages!Z11=\"\",\"\",\"9 / \"&Réglages!Z11)","v":""},{"$f":"IF(Réglages!AA11=\"\",\"\",\"9 / \"&Réglages!AA11)","v":""},{"$f":"IF(Réglages!AB11=\"\",\"\",\"9 / \"&Réglages!AB11)","v":""},{"$f":"IF(Réglages!AC11=\"\",\"\",\"9 / \"&Réglages!AC11)","v":""},{"$f":"IF(Réglages!AD11=\"\",\"\",\"9 / \"&Réglages!AD11)","v":""},{"$f":"IF(Réglages!AE11=\"\",\"\",\"9 / \"&Réglages!AE11)","v":""},{"$f":"IF(Réglages!AF11=\"\",\"\",\"9 / \"&Réglages!AF11)","v":""},{"$f":"IF(Réglages!AG11=\"\",\"\",\"9 / \"&Réglages!AG11)","v":""}]
[null,null,null,null,null,null,null,null,null,null,null,null,null,null,null,null,null,null,null,{"$f":"IF(Réglages!$E$57>=1,\"L1\",\"\")","v":"L1"},{"$f":"IF(Réglages!$E$57>=2,\"L2\",\"\")","v":"L2"},{"$f":"IF(Réglages!$E$57>=3,\"L3\",\"\")","v":"L3"},{"$f":"IF(Réglages!$E$57>=4,\"L4\",\"\")","v":"L4"},{"$f":"IF(Réglages!$E$57>=5,\"L5\",\"\")","v":"L5"},{"$f":"IF(Réglages!$E$57>=6,\"L6\",\"\")","v":"L6"},{"$f":"IF(Réglages!$E$57>=7,\"L7\",\"\")","v":"L7"},{"$f":"IF(Réglages!$E$57>=8,\"L8\",\"\")","v":"L8"},{"$f":"IF(Réglages!$E$57>=9,\"L9\",\"\")","v":"L9"},{"$f":"IF(Réglages!$E$57>=10,\"L10\",\"\")","v":"L10"},{"$f":"IF(Réglages!$E$57>=11,\"L11\",\"\")","v":"L11"},{"$f":"IF(Réglages!$E$57>=12,\"L12\",\"\")","v":"L12"},"Moi","Prof",null,null,null,null,null,null,null,null,null,null,null,null,null,null,null,null,null,null,{"$f":"IF(Réglages!Z12=\"\",\"\",\"10/ \"&Réglages!Z12)","v":""},{"$f":"IF(Réglages!AA12=\"\",\"\",\"10/ \"&Réglages!AA12)","v":""},{"$f":"IF(Réglages!AB12=\"\",\"\",\"10/ \"&Réglages!AB12)","v":""},{"$f":"IF(Réglages!AC12=\"\",\"\",\"10/ \"&Réglages!AC12)","v":""},{"$f":"IF(Réglages!AD12=\"\",\"\",\"10/ \"&Réglages!AD12)","v":""},{"$f":"IF(Réglages!AE12=\"\",\"\",\"10/ \"&Réglages!AE12)","v":""},{"$f":"IF(Réglages!AF12=\"\",\"\",\"10/ \"&Réglages!AF12)","v":""},{"$f":"IF(Réglages!AG12=\"\",\"\",\"10/ \"&Réglages!AG12)","v":""}]
[null,null,null,null,null,null,null,null,null,null,null,null,null,null,null,null,null,null,null,null,null,null,null,null,null,null,null,null,null,null,null,null,null,null,null,null,null,null,null,null,null,null,null,null,null,null,null,null,null,null,null,{"$f":"IF(Réglages!Z13=\"\",\"\",\"11/ \"&Réglages!Z13)","v":""},{"$f":"IF(Réglages!AA13=\"\",\"\",\"11/ \"&Réglages!AA13)","v":""},{"$f":"IF(Réglages!AB13=\"\",\"\",\"11/ \"&Réglages!AB13)","v":""},{"$f":"IF(Réglages!AC13=\"\",\"\",\"11/ \"&Réglages!AC13)","v":""},{"$f":"IF(Réglages!AD13=\"\",\"\",\"11/ \"&Réglages!AD13)","v":""},{"$f":"IF(Réglages!AE13=\"\",\"\",\"11/ \"&Réglages!AE13)","v":""},{"$f":"IF(Réglages!AF13=\"\",\"\",\"11/ \"&Réglages!AF13)","v":""},{"$f":"IF(Réglages!AG13=\"\",\"\",\"11/ \"&Réglages!AG13)","v":""}]
[null,null,null,null,null,null,null,null,null,null,null,null,null,null,null,null,null,null,"Leçon 1",null,null,null,null,null,null,null,null,null,null,null,null,null,null,null,null,null,null,null,null,null,null,null,null,{"$f":"RIGHT(S23,1)+1","v":2},{"$f":"MATCH(AG25,IF(AW25=1,AZ12:AZ21,IF(AW25=2,BA12:BA21,1)),0)","v":{"$error":"#VALUE!"}},{"$f":"OR(AND(AW25=1,MATCH(AG25,AZ12:AZ21,0)),(AND(AW25=2,MATCH(AG25,BA12:BA21,0))))","v":{"$error":"#VALUE!"}},null,null,null,null,null,{"$f":"IF(Réglages!Z14=\"\",\"\",\"12/ \"&Réglages!Z14)","v":""},{"$f":"IF(Réglages!AA14=\"\",\"\",\"12/ \"&Réglages!AA14)","v":""},{"$f":"IF(Réglages!AB14=\"\",\"\",\"12/ \"&Réglages!AB14)","v":""},{"$f":"IF(Réglages!AC14=\"\",\"\",\"12/ \"&Réglages!AC14)","v":""},{"$f":"IF(Réglages!AD14=\"\",\"\",\"12/ \"&Réglages!AD14)","v":""},{"$f":"IF(Réglages!AE14=\"\",\"\",\"12/ \"&Réglages!AE14)","v":""},{"$f":"IF(Réglages!AF14=\"\",\"\",\"12/ \"&Réglages!AF14)","v":""},{"$f":"IF(Réglages!AG14=\"\",\"\",\"12/ \"&Réglages!AG14)","v":""}]
[null,null,null,null,null,null,null,null,null,null,null,null,null,null,null,null,null,null,{"$f":"Réglages!$D$54","v":"Axes de Travail "},null,null,null,null,null,null,null,null,null,null,null,null,null,{"$f":"Réglages!$F$50","v":"Situations d'apprentissage"},null,null,null,{"$f":"Réglages!$F$51","v":"Résultats "},null,{"$f":"Réglages!$F$52","v":"Je me projette"},null,null,null,null,-1,0,1,"réf",null,"n colonne","n ligne ",null,{"$f":"IF(Réglages!Z15=\"\",\"\",\"13/ \"&Réglages!Z15)","v":""},{"$f":"IF(Réglages!AA15=\"\",\"\",\"13/ \"&Réglages!AA15)","v":""},{"$f":"IF(Réglages!AB15=\"\",\"\",\"13/ \"&Réglages!AB15)","v":""},{"$f":"IF(Réglages!AC15=\"\",\"\",\"13/ \"&Réglages!AC15)","v":""},{"$f":"IF(Réglages!AD15=\"\",\"\",\"13/ \"&Réglages!AD15)","v":""},{"$f":"IF(Réglages!AE15=\"\",\"\",\"13/ \"&Réglages!AE15)","v":""},{"$f":"IF(Réglages!AF15=\"\",\"\",\"13/ \"&Réglages!AF15)","v":""},{"$f":"IF(Réglages!AG15=\"\",\"\",\"13/ \"&Réglages!AG15)","v":""}]
[null,null,null,null,null,null,null,null,null,null,null,null,null,null,null,null,null,null,"",null,null,null,null,null,null,null,null,null,{"$f":"IF(S25=\"\",\"\",INDEX($AZ$10:$BG$10,MATCH(S25,$AZ$8:$BG$8,0)))","v":""},null,null,null,null,null,null,null,null,null,"",null,null,null,{"$f":"IF(AG25=\"\",\"\",ISNUMBER(MATCH(AG25,IF(AW25=1,$AZ$12:$AZ$26,IF(AW25=2,$BA$12:$BA$26,IF(AW25=3,$BB$12:$BB$26,IF(AW25=4,$BC$12:$BC$26,IF(AW25=5,$BD$12:$BD$26,IF(AW$5=6,$BE$12:$BE$26,IF(AW25=7,$BF$12:$BF$26,IF(AW25=8,$BG$12:$BG$26,1)))))))),0)))","v":""},{"$f":"IFERROR(INDEX($AZ$12:$BG$26,AX25-1,AW25),\"\")","v":""},{"$f":"IFERROR(INDEX($AZ$12:$BG$26,AX25,AW25),\"\")","v":""},{"$f":"IFERROR(INDEX($AZ$12:$BG$26,AX25+1,AW25),\"\")","v":""},"Sit de Réf",null,{"$f":"VALUE(RIGHT(AC25,1))","v":{"$error":"#VALUE!"}},{"$f":"VALUE(LEFT(AG25,2))","v":{"$error":"#VALUE!"}},{"$f":"IF(AM25=\"\",\"\",IF(AM25=AU25,AU25,ISNUMBER(MATCH(AM25,IF(AW25=1,$AZ$12:$AZ$26,IF(AW25=2,$BA$12:$BA$26,IF(AW25=3,$BB$12:$BB$26,IF(AW25=4,$BC$12:$BC$26,IF(AW25=5,$BD$12:$BD$26,IF(AW$5=6,$BE$12:$BE$26,IF(AW25=7,$BF$12:$BF$26,IF(AW25=8,$BG$12:$BG$26,1)))))))),0))))","v":""},{"$f":"IF(Réglages!Z16=\"\",\"\",\"14/ \"&Réglages!Z16)","v":""},{"$f":"IF(Réglages!AA16=\"\",\"\",\"14/ \"&Réglages!AA16)","v":""},{"$f":"IF(Réglages!AB16=\"\",\"\",\"14/ \"&Réglages!AB16)","v":""},{"$f":"IF(Réglages!AC16=\"\",\"\",\"14/ \"&Réglages!AC16)","v":""},{"$f":"IF(Réglages!AD16=\"\",\"\",\"14/ \"&Réglages!AD16)","v":""},{"$f":"IF(Réglages!AE16=\"\",\"\",\"14/ \"&Réglages!AE16)","v":""},{"$f":"IF(Réglages!AF16=\"\",\"\",\"14/ \"&Réglages!AF16)","v":""},{"$f":"IF(Réglages!AG16=\"\",\"\",\"14/ \"&Réglages!AG16)","v":""}]
[null,null,null,null,null,null,null,null,null,null,null,null,null,null,null,null,null,null,"",null,null,null,null,null,null,null,null,null,"",null,null,null,null,null,null,null,null,null,"5/ sit5",null,null,null,{"$f":"IF(AG26=\"\",\"\",ISNUMBER(MATCH(AG26,IF(AW26=1,$AZ$12:$AZ$26,IF(AW26=2,$BA$12:$BA$26,IF(AW26=3,$BB$12:$BB$26,IF(AW26=4,$BC$12:$BC$26,IF(AW26=5,$BD$12:$BD$26,IF(AW$5=6,$BE$12:$BE$26,IF(AW26=7,$BF$12:$BF$26,IF(AW26=8,$BG$12:$BG$26,1)))))))),0)))","v":""},{"$f":"IFERROR(INDEX($AZ$12:$BG$26,AX26-1,AW26),\"\")","v":""},{"$f":"IFERROR(INDEX($AZ$12:$BG$26,AX26,AW26),\"\")","v":""},{"$f":"IFERROR(INDEX($AZ$12:$BG$26,AX26+1,AW26),\"\")","v":""},"Sit de Réf",null,{"$error":"#VALUE!"},{"$f":"VALUE(LEFT(AG26,2))","v":{"$error":"#VALUE!"}},{"$f":"IF(AM26=\"\",\"\",IF(AM26=AU26,AU26,ISNUMBER(MATCH(AM26,IF(AW26=1,$AZ$12:$AZ$26,IF(AW26=2,$BA$12:$BA$26,IF(AW26=3,$BB$12:$BB$26,IF(AW26=4,$BC$12:$BC$26,IF(AW26=5,$BD$12:$BD$26,IF(AW$5=6,$BE$12:$BE$26,IF(AW26=7,$BF$12:$BF$26,IF(AW26=8,$BG$12:$BG$26,1)))))))),0))))","v":false},{"$f":"IF(Réglages!Z17=\"\",\"\",\"15/ \"&Réglages!Z17)","v":""},{"$f":"IF(Réglages!AA17=\"\",\"\",\"15/ \"&Réglages!AA17)","v":""},{"$f":"IF(Réglages!AB17=\"\",\"\",\"15/ \"&Réglages!AB17)","v":""},{"$f":"IF(Réglages!AC17=\"\",\"\",\"15/ \"&Réglages!AC17)","v":""},{"$f":"IF(Réglages!AD17=\"\",\"\",\"15/ \"&Réglages!AD17)","v":""},{"$f":"IF(Réglages!AE17=\"\",\"\",\"15/ \"&Réglages!AE17)","v":""},{"$f":"IF(Réglages!AF17=\"\",\"\",\"15/ \"&Réglages!AF17)","v":""},{"$f":"IF(Réglages!AG17=\"\",\"\",\"15/ \"&Réglages!AG17)","v":""}]
[null,null,null,null,null,null,null,null,null,null,null,null,null,null,null,null,null,null,"",null,null,null,null,null,null,null,null,null,"",null,null,null,null,null,null,null,null,null,null,null,null,null,"","","","","Sit de Réf",null,{"$error":"#VALUE!"},{"$error":"#VALUE!"},""]
[null,null,null,null,null,null,null,null,null,null,null,null,null,null,null,null,null,null,"",null,null,null,null,null,null,null,null,null,"",null,null,null,null,null,null,null,null,null,"4/ sit4",null,null,null,"","","","","Sit de Réf",null,{"$error":"#VALUE!"},{"$error":"#VALUE!"},false]
[null,null,null,null,null,null,null,null,null,null,null,null,null,null,null,null,null,null,"",null,null,null,null,null,null,null,null,null,"",null,null,null,null,null,null,null,null,null,"4/ sit4",null,null,null,"","","","","Sit de Réf",null,{"$error":"#VALUE!"},{"$error":"#VALUE!"},false]
[null,null,null,null,null,null,null,null,null,null,null,null,null,null,null,null,null,null,"",null,null,null,null,null,null,null,null,null,"",null,null,null,null,null,null,null,null,null,"4/ d",null,null,null,"","","","","Sit de Réf",null,{"$error":"#VALUE!"},{"$error":"#VALUE!"},false]
[null,null,null,null,null,null,null,null,null,null,null,null,null,null,null,null,null,null,"",null,null,null,null,null,null,null,null,null,"",null,null,null,null,null,null,null,null,null,null,null,null,null,"","","","","Sit de Réf",null,{"$error":"#VALUE!"},{"$error":"#VALUE!"},""]
[null,null,null,null,null,null,null,null,null,null,null,null,null,null,null,null,null,null,"",null,null,null,null,null,null,null,null,null,"",null,null,null,null,null,null,null,null,null,null,null,null,null,"","","","","Sit de Réf",null,{"$error":"#VALUE!"},{"$error":"#VALUE!"},""]
[null,null,null,null,null,null,null,null,null,null,null,null,null,null,null,null,null,null,"",null,null,null,null,null,null,null,null,null,"",null,null,null,null,null,null,null,null,null,null,null,null,null,"","","","","Sit de Réf",null,{"$error":"#VALUE!"},{"$error":"#VALUE!"},"",{"$f":"$AZ$9","v":"Moteur "},{"$f":"$BA$9","v":"Non moteur"},{"$f":"$BB$9","v":"Quel enjeu ?"},{"$f":"$BC$9","v":""},{"$f":"$BD$9","v":""},{"$f":"$BE$9","v":""},{"$f":"$BF$9","v":""},{"$f":"$BG$9","v":""}]
[null,null,null,null,null,null,null,null,null,null,null,null,null,null,null,null,null,null,"",null,null,null,null,null,null,null,null,null,"",null,null,null,null,null,null,null,null,null,null,null,null,null,"","","","","Sit de Réf",null,{"$error":"#VALUE!"},{"$error":"#VALUE!"},"",{"$f":"IF(Réglages!$B$12=\"\",\"\",\"Sit de Réf :  \"&Réglages!$B$12)","v":"Sit de Réf :  Le sablier"},{"$f":"IF(Réglages!$C$12=\"\",\"\",\"Sit de Réf :  \"&Réglages!$C$12)","v":""},{"$f":"IF(Réglages!$D$12=\"\",\"\",\"Sit de Réf :  \"&Réglages!$D$12)","v":""},{"$f":"IF(Réglages!$E$12=\"\",\"\",\"Sit de Réf :  \"&Réglages!$E$12)","v":""},{"$f":"IF(Réglages!$F$12=\"\",\"\",\"Sit de Réf :  \"&Réglages!$F$12)","v":""},{"$f":"IF(Réglages!$G$12=\"\",\"\",\"Sit de Réf :  \"&Réglages!$G$12)","v":""},{"$f":"IF(Réglages!$H$12=\"\",\"\",\"Sit de Réf :  \"&Réglages!$H$12)","v":""},{"$f":"IF(Réglages!$I$12=\"\",\"\",\"Sit de Réf :  \"&Réglages!$I$12)","v":""}]
[null,null,null,null,null,null,null,null,null,null,null,null,null,null,null,null,null,null,{"$f":"Réglages!$F$53","v":"Enjeu de travail principal de cette leçon >"},null,null,null,null,null,"",null,null,null,null,null,null,null,{"$f":"IF(Y35=\"\",\"\",IF(Y35=$AZ$39,$AZ$34,IF(Y35=$BA$39,$BA$34,IF(Y35=$BB$39,$BB$34,IF(Y35=$BC$39,$BC$34,IF(Y35=$BD$39,$BD$34,IF(Y35=$BE$39,$BE$34,IF(Y35=$BF$39,$BF$34,$BG$34))))))))","v":""},null,{"$f":"Réglages!$H$50","v":"Critères rappel >"},null,"C1 Main haute",null,{"$f":"Réglages!$H$51","v":"Je me situe >"},null,null,null,{"$f":"IF(AK35=\"\",\"\",ISNUMBER(MATCH(AK35,IF(AT35=1,$AZ$35:$AZ$38,IF(AT35=2,$BA$35:$BA$38,IF(AT35=3,$BB$35:$BB$38,IF(AT35=4,$BC$35:$BC$38,IF(AT35=5,$BD$35:$BD$38,IF(AW$5=6,$BE$35:$BE$38,IF(AT35=7,$BF$35:$BF$38,IF(AT35=8,$BG$35:$BG$38,1)))))))),0)))","v":false},"droite axe !!!!",{"$f":"IF(Y35=\"\",\"\",INDEX($AZ$10:$BG$10,MATCH(Y35,$AZ$8:$BG$8,0)))","v":""},{"$f":"VALUE(RIGHT(AS35,1))","v":{"$error":"#VALUE!"}},null,null,null,null,"c1",{"$f":"IF(Réglages!$B$14=\"\",\"\",\"C1 \"&Réglages!$B$14)","v":"C1 9 points"},{"$f":"IF(Réglages!$C$14=\"\",\"\",\"C1 \"&Réglages!$C$14)","v":""},{"$f":"IF(Réglages!$D$14=\"\",\"\",\"C1 \"&Réglages!$D$14)","v":""},{"$f":"IF(Réglages!$E$14=\"\",\"\",\"C1 \"&Réglages!$E$14)","v":""},{"$f":"IF(Réglages!$F$14=\"\",\"\",\"C1 \"&Réglages!$F$14)","v":""},{"$f":"IF(Réglages!$G$14=\"\",\"\",\"C1 \"&Réglages!$G$14)","v":""},{"$f":"IF(Réglages!$H$14=\"\",\"\",\"C1 \"&Réglages!$H$14)","v":""},{"$f":"IF(Réglages!$I$14=\"\",\"\",\"C1 \"&Réglages!$I$14)","v":""}]
[null,null,null,null,null,null,null,null,null,null,null,null,null,null,null,null,null,null,{"$f":"Réglages!$F$54","v":"Enjeu de travail secondaire de cette leçon >"},null,null,null,null,null,"",null,null,null,null,null,null,null,{"$f":"IF(Y36=\"\",\"\",IF(Y36=$AZ$39,$AZ$34,IF(Y36=$BA$39,$BA$34,IF(Y36=$BB$39,$BB$34,IF(Y36=$BC$39,$BC$34,IF(Y36=$BD$39,$BD$34,IF(Y36=$BE$39,$BE$34,IF(Y36=$BF$39,$BF$34,$BG$34))))))))","v":""},null,{"$f":"Réglages!$H$50","v":"Critères rappel >"},null,"C3 Fiable",null,{"$f":"Réglages!$H$51","v":"Je me situe >"},null,null,null,{"$f":"IF(AK36=\"\",\"\",ISNUMBER(MATCH(AK36,IF(AT36=1,$AZ$35:$AZ$38,IF(AT36=2,$BA$35:$BA$38,IF(AT36=3,$BB$35:$BB$38,IF(AT36=4,$BC$35:$BC$38,IF(AT36=5,$BD$35:$BD$38,IF(AW$5=6,$BE$35:$BE$38,IF(AT36=7,$BF$35:$BF$38,IF(AT36=8,$BG$35:$BG$38,1)))))))),0)))","v":false},null,{"$f":"IF(Y36=\"\",\"\",INDEX($AZ$10:$BG$10,MATCH(Y36,$AZ$8:$BG$8,0)))","v":""},{"$f":"VALUE(RIGHT(AS36,1))","v":{"$error":"#VALUE!"}},null,"SI(AE35=AZ39;AZ35:AZ38;SI(AE35=BA39;BA35:BA38;SI(AE35=Bb39;Bb35:Bb38;SI(AE35=Bc39;Bc35:Bc38;SI(AE35=Bd39;Bd35:Bd38;SI(AE35=Be39;Be35:Be38;SI(AE35=Bf39;Bf35:Bf38;SI(AE35=Bg39;Bg35:Bg38;AY35:AY38))))))))",null,null,"c2",{"$f":"IF(Réglages!$B$15=\"\",\"\",\"C2 \"&Réglages!$B$15)","v":"C2 99 points"},{"$f":"IF(Réglages!$C$15=\"\",\"\",\"C2 \"&Réglages!$C$15)","v":""},{"$f":"IF(Réglages!$D$15=\"\",\"\",\"C2 \"&Réglages!$D$15)","v":""},{"$f":"IF(Réglages!$E$15=\"\",\"\",\"C2 \"&Réglages!$E$15)","v":""},{"$f":"IF(Réglages!$F$15=\"\",\"\",\"C2 \"&Réglages!$F$15)","v":""},{"$f":"IF(Réglages!$G$15=\"\",\"\",\"C2 \"&Réglages!$G$15)","v":""},{"$f":"IF(Réglages!$H$15=\"\",\"\",\"C2 \"&Réglages!$H$15)","v":""},{"$f":"IF(Réglages!$I$15=\"\",\"\",\"C2 \"&Réglages!$I$15)","v":""}]
[null,null,null,null,null,null,null,null,null,null,null,null,null,null,null,null,null,null,{"$f":" Réglages!$H$52&AR23&\" >\"","v":"Mon Projet pour L2 >"},null,null,null,null,null,null,null,null,null,null,null,null,null,null,null,null,null,null,null,{"$f":"Réglages!$H$53&AR23&\" >\"","v":"Mon Axe Pioritaire en L2 >"},null,"",null,null,null,null,null,null,null,null,null,"c3",{"$f":"IF(Réglages!$B$16=\"\",\"\",\"C3 \"&Réglages!$B$16)","v":"C3 999 pts "},{"$f":"IF(Réglages!$C$16=\"\",\"\",\"C3 \"&Réglages!$C$16)","v":""},{"$f":"IF(Réglages!$D$16=\"\",\"\",\"C3 \"&Réglages!$D$16)","v":""},{"$f":"IF(Réglages!$E$16=\"\",\"\",\"C3 \"&Réglages!$E$16)","v":""},{"$f":"IF(Réglages!$F$16=\"\",\"\",\"C3 \"&Réglages!$F$16)","v":""},{"$f":"IF(Réglages!$G$16=\"\",\"\",\"C3 \"&Réglages!$G$16)","v":""},{"$f":"IF(Réglages!$H$16=\"\",\"\",\"C3 \"&Réglages!$H$16)","v":""},{"$f":"IF(Réglages!$I$16=\"\",\"\",\"C3 \"&Réglages!$I$16)","v":""}]
[null,null,null,null,null,null,null,null,null,null,null,null,null,null,null,null,null,null,null,null,null,null,null,null,null,null,null,null,null,null,null,null,null,null,null,null,null,null,null,null,null,null,null,null,null,null,null,null,null,null,"c4",{"$f":"IF(Réglages!$B$17=\"\",\"\",\"C4 \"&Réglages!$B$17)","v":"C4 9999 pts"},{"$f":"IF(Réglages!$C$17=\"\",\"\",\"C4 \"&Réglages!$C$17)","v":""},{"$f":"IF(Réglages!$D$17=\"\",\"\",\"C4 \"&Réglages!$D$17)","v":""},{"$f":"IF(Réglages!$E$17=\"\",\"\",\"C4 \"&Réglages!$E$17)","v":""},{"$f":"IF(Réglages!$F$17=\"\",\"\",\"C4 \"&Réglages!$F$17)","v":""},{"$f":"IF(Réglages!$G$17=\"\",\"\",\"C4 \"&Réglages!$G$17)","v":""},{"$f":"IF(Réglages!$H$17=\"\",\"\",\"C4 \"&Réglages!$H$17)","v":""},{"$f":"IF(Réglages!$I$17=\"\",\"\",\"C4 \"&Réglages!$I$17)","v":""}]
[null,null,null,null,null,null,null,null,null,null,null,null,null,null,null,null,null,null,null,null,null,null,null,null,null,null,null,null,null,null,null,null,null,null,null,null,null,null,null,null,null,null,null,null,null,null,null,null,null,null,{"$f":"Réglages!$L$5","v":"Moteur "},{"$f":"IF($AZ$8=\"\",\"\",$AZ$8)","v":"Le serveur "},{"$f":"IF($BA$8=\"\",\"\",$BA$8)","v":"Observateur"},{"$f":"IF($BB$8=\"\",\"\",$BB$8)","v":"?"},{"$f":"IF($BC$8=\"\",\"\",$BC$8)","v":""},{"$f":"IF($BD$8=\"\",\"\",$BD$8)","v":""},{"$f":"IF($BE$8=\"\",\"\",$BE$8)","v":""},{"$f":"IF($BF$8=\"\",\"\",$BF$8)","v":""},{"$f":"IF($BG$8=\"\",\"\",$BG$8)","v":""}]
[null,null,null,null,null,null,null,null,null,null,null,null,null,null,null,null,null,null,null,null,null,null,null,null,null,null,null,null,null,null,null,null,null,null,null,null,null,null,null,null,null,null,null,null,null,null,null,null,null,null,{"$f":"Réglages!$L$6","v":"Non moteur"},{"$f":"IF($AZ$8=\"\",\"\",$AZ$8)","v":"Le serveur "},{"$f":"IF($BA$8=\"\",\"\",$BA$8)","v":"Observateur"},{"$f":"IF($BB$8=\"\",\"\",$BB$8)","v":"?"},{"$f":"IF($BC$8=\"\",\"\",$BC$8)","v":""},{"$f":"IF($BD$8=\"\",\"\",$BD$8)","v":""},{"$f":"IF($BE$8=\"\",\"\",$BE$8)","v":""},{"$f":"IF($BF$8=\"\",\"\",$BF$8)","v":""},{"$f":"IF($BG$8=\"\",\"\",$BG$8)","v":""}]
[]
[]
[null,null,null,null,null,null,null,null,null,null,null,null,null,null,null,null,null,"Leçon 2",null,null,null,null,null,null,null,null,null,null,null,null,null,null,null,null,null,null,null,null,null,null,null,null,null,{"$f":"RIGHT(R43,1)+1","v":3},{"$f":"MATCH(AG45,IF(AW45=1,AZ32:AZ41,IF(AW45=2,BA32:BA41,1)),0)","v":{"$error":"#VALUE!"}},{"$f":"OR(AND(AW45=1,MATCH(AG45,AZ32:AZ41,0)),(AND(AW45=2,MATCH(AG45,BA32:BA41,0))))","v":{"$error":"#VALUE!"}}]
[null,null,null,null,null,null,null,null,null,null,null,null,null,null,null,null,null,null,{"$f":"Réglages!$D$54","v":"Axes de Travail "},null,null,null,null,null,null,null,null,null,null,null,null,null,{"$f":"Réglages!$F$50","v":"Situations d'apprentissage"},null,null,null,{"$f":"Réglages!$F$51","v":"Résultats "},null,{"$f":"Réglages!$F$52","v":"Je me projette"},null,null,null,null,-1,0,1,"réf",null,"n colonne","n ligne "]
[null,null,null,null,null,null,null,null,null,null,null,null,null,null,null,null,null,null,"",null,null,null,null,null,null,null,null,null,{"$f":"IF(S45=\"\",\"\",INDEX($AZ$10:$BG$10,MATCH(S45,$AZ$8:$BG$8,0)))","v":""},null,null,null,null,null,null,null,null,null,null,null,null,null,{"$f":"IF(AG45=\"\",\"\",ISNUMBER(MATCH(AG45,IF(AW45=1,$AZ$12:$AZ$26,IF(AW45=2,$BA$12:$BA$26,IF(AW45=3,$BB$12:$BB$26,IF(AW45=4,$BC$12:$BC$26,IF(AW45=5,$BD$12:$BD$26,IF(AW$5=6,$BE$12:$BE$26,IF(AW45=7,$BF$12:$BF$26,IF(AW45=8,$BG$12:$BG$26,1)))))))),0)))","v":""},{"$f":"IFERROR(INDEX($AZ$12:$BG$26,AX45-1,AW45),\"\")","v":""},{"$f":"IFERROR(INDEX($AZ$12:$BG$26,AX45,AW45),\"\")","v":""},{"$f":"IFERROR(INDEX($AZ$12:$BG$26,AX45+1,AW45),\"\")","v":""},"Sit de Réf",null,{"$f":"VALUE(RIGHT(AC45,1))","v":{"$error":"#VALUE!"}},{"$f":"VALUE(LEFT(AG45,2))","v":{"$error":"#VALUE!"}},{"$f":"IF(AM45=\"\",\"\",IF(AM45=AU45,AU45,ISNUMBER(MATCH(AM45,IF(AW45=1,$AZ$12:$AZ$26,IF(AW45=2,$BA$12:$BA$26,IF(AW45=3,$BB$12:$BB$26,IF(AW45=4,$BC$12:$BC$26,IF(AW45=5,$BD$12:$BD$26,IF(AW$5=6,$BE$12:$BE$26,IF(AW45=7,$BF$12:$BF$26,IF(AW45=8,$BG$12:$BG$26,1)))))))),0))))","v":""}]
[null,null,null,null,null,null,null,null,null,null,null,null,null,null,null,null,null,null,"",null,null,null,null,null,null,null,null,null,"",null,null,null,null,null,null,null,null,null,null,null,null,null,{"$f":"IF(AG46=\"\",\"\",ISNUMBER(MATCH(AG46,IF(AW46=1,$AZ$12:$AZ$26,IF(AW46=2,$BA$12:$BA$26,IF(AW46=3,$BB$12:$BB$26,IF(AW46=4,$BC$12:$BC$26,IF(AW46=5,$BD$12:$BD$26,IF(AW$5=6,$BE$12:$BE$26,IF(AW46=7,$BF$12:$BF$26,IF(AW46=8,$BG$12:$BG$26,1)))))))),0)))","v":""},{"$f":"IFERROR(INDEX($AZ$12:$BG$26,AX46-1,AW46),\"\")","v":""},{"$f":"IFERROR(INDEX($AZ$12:$BG$26,AX46,AW46),\"\")","v":""},{"$f":"IFERROR(INDEX($AZ$12:$BG$26,AX46+1,AW46),\"\")","v":""},"Sit de Réf",null,{"$error":"#VALUE!"},{"$f":"VALUE(LEFT(AG46,2))","v":{"$error":"#VALUE!"}},{"$f":"IF(AM46=\"\",\"\",IF(AM46=AU46,AU46,ISNUMBER(MATCH(AM46,IF(AW46=1,$AZ$12:$AZ$26,IF(AW46=2,$BA$12:$BA$26,IF(AW46=3,$BB$12:$BB$26,IF(AW46=4,$BC$12:$BC$26,IF(AW46=5,$BD$12:$BD$26,IF(AW$5=6,$BE$12:$BE$26,IF(AW46=7,$BF$12:$BF$26,IF(AW46=8,$BG$12:$BG$26,1)))))))),0))))","v":""}]
[null,null,null,null,null,null,null,null,null,null,null,null,null,null,null,null,null,null,"",null,null,null,null,null,null,null,null,null,"",null,null,null,null,null,null,null,null,null,null,null,null,null,"","","","","Sit de Réf",null,{"$error":"#VALUE!"},{"$error":"#VALUE!"},""]
[null,null,null,null,null,null,null,null,null,null,null,null,null,null,null,null,null,null,"",null,null,null,null,null,null,null,null,null,"",null,null,null,null,null,null,null,null,null,null,null,null,null,"","","","","Sit de Réf",null,{"$error":"#VALUE!"},{"$error":"#VALUE!"},""]
[null,null,null,null,null,null,null,null,null,null,null,null,null,null,null,null,null,null,"",null,null,null,null,null,null,null,null,null,"",null,null,null,null,null,null,null,null,null,null,null,null,null,"","","","","Sit de Réf",null,{"$error":"#VALUE!"},{"$error":"#VALUE!"},""]
[null,null,null,null,null,null,null,null,null,null,null,null,null,null,null,null,null,null,"",null,null,null,null,null,null,null,null,null,"",null,null,null,null,null,null,null,null,null,null,null,null,null,"","","","","Sit de Réf",null,{"$error":"#VALUE!"},{"$error":"#VALUE!"},""]
[null,null,null,null,null,null,null,null,null,null,null,null,null,null,null,null,null,null,"",null,null,null,null,null,null,null,null,null,"",null,null,null,null,null,null,null,null,null,null,null,null,null,"","","","","Sit de Réf",null,{"$error":"#VALUE!"},{"$error":"#VALUE!"},""]
[null,null,null,null,null,null,null,null,null,null,null,null,null,null,null,null,null,null,"",null,null,null,null,null,null,null,null,null,"",null,null,null,null,null,null,null,null,null,null,null,null,null,"","","","","Sit de Réf",null,{"$error":"#VALUE!"},{"$error":"#VALUE!"},""]
[null,null,null,null,null,null,null,null,null,null,null,null,null,null,null,null,null,null,"",null,null,null,null,null,null,null,null,null,"",null,null,null,null,null,null,null,null,null,null,null,null,null,"","","","","Sit de Réf",null,{"$error":"#VALUE!"},{"$error":"#VALUE!"},"",{"$f":"$AZ$9","v":"Moteur "},{"$f":"$BA$9","v":"Non moteur"},{"$f":"$BB$9","v":"Quel enjeu ?"},{"$f":"$BC$9","v":""},{"$f":"$BD$9","v":""},{"$f":"$BE$9","v":""},{"$f":"$BF$9","v":""},{"$f":"$BG$9","v":""}]
[null,null,null,null,null,null,null,null,null,null,null,null,null,null,null,null,null,null,"",null,null,null,null,null,null,null,null,null,"",null,null,null,null,null,null,null,null,null,null,null,null,null,"","","","","Sit de Réf",null,{"$error":"#VALUE!"},{"$error":"#VALUE!"},"",{"$f":"IF(Réglages!$B$12=\"\",\"\",\"Sit de Réf :  \"&Réglages!$B$12)","v":"Sit de Réf :  Le sablier"},{"$f":"IF(Réglages!$C$12=\"\",\"\",\"Sit de Réf :  \"&Réglages!$C$12)","v":""},{"$f":"IF(Réglages!$D$12=\"\",\"\",\"Sit de Réf :  \"&Réglages!$D$12)","v":""},{"$f":"IF(Réglages!$E$12=\"\",\"\",\"Sit de Réf :  \"&Réglages!$E$12)","v":""},{"$f":"IF(Réglages!$F$12=\"\",\"\",\"Sit de Réf :  \"&Réglages!$F$12)","v":""},{"$f":"IF(Réglages!$G$12=\"\",\"\",\"Sit de Réf :  \"&Réglages!$G$12)","v":""},{"$f":"IF(Réglages!$H$12=\"\",\"\",\"Sit de Réf :  \"&Réglages!$H$12)","v":""},{"$f":"IF(Réglages!$I$12=\"\",\"\",\"Sit de Réf :  \"&Réglages!$I$12)","v":""}]
[null,null,null,null,null,null,null,null,null,null,null,null,null,null,null,null,null,null,{"$f":"Réglages!$F$53","v":"Enjeu de travail principal de cette leçon >"},null,null,null,null,null,"",null,null,null,null,null,null,null,{"$f":"IF(Y55=\"\",\"\",IF(Y55=$AZ$39,$AZ$34,IF(Y55=$BA$39,$BA$34,IF(Y55=$BB$39,$BB$34,IF(Y55=$BC$39,$BC$34,IF(Y55=$BD$39,$BD$34,IF(Y55=$BE$39,$BE$34,IF(Y55=$BF$39,$BF$34,$BG$34))))))))","v":""},null,{"$f":"Réglages!$H$50","v":"Critères rappel >"},null,"C2 fggzev",null,{"$f":"Réglages!$H$51","v":"Je me situe >"},null,null,null,{"$f":"IF(AK55=\"\",\"\",ISNUMBER(MATCH(AK55,IF(AT55=1,$AZ$35:$AZ$38,IF(AT55=2,$BA$35:$BA$38,IF(AT55=3,$BB$35:$BB$38,IF(AT55=4,$BC$35:$BC$38,IF(AT55=5,$BD$35:$BD$38,IF(AW$5=6,$BE$35:$BE$38,IF(AT55=7,$BF$35:$BF$38,IF(AT55=8,$BG$35:$BG$38,1)))))))),0)))","v":false},"droite axe !!!!",{"$f":"IF(Y55=\"\",\"\",INDEX($AZ$10:$BG$10,MATCH(Y55,$AZ$8:$BG$8,0)))","v":""},{"$f":"VALUE(RIGHT(AS55,1))","v":{"$error":"#VALUE!"}},null,null,null,null,"c1",{"$f":"IF(Réglages!$B$14=\"\",\"\",\"C1 \"&Réglages!$B$14)","v":"C1 9 points"},{"$f":"IF(Réglages!$C$14=\"\",\"\",\"C1 \"&Réglages!$C$14)","v":""},{"$f":"IF(Réglages!$D$14=\"\",\"\",\"C1 \"&Réglages!$D$14)","v":""},{"$f":"IF(Réglages!$E$14=\"\",\"\",\"C1 \"&Réglages!$E$14)","v":""},{"$f":"IF(Réglages!$F$14=\"\",\"\",\"C1 \"&Réglages!$F$14)","v":""},{"$f":"IF(Réglages!$G$14=\"\",\"\",\"C1 \"&Réglages!$G$14)","v":""},{"$f":"IF(Réglages!$H$14=\"\",\"\",\"C1 \"&Réglages!$H$14)","v":""},{"$f":"IF(Réglages!$I$14=\"\",\"\",\"C1 \"&Réglages!$I$14)","v":""}]
[null,null,null,null,null,null,null,null,null,null,null,null,null,null,null,null,null,null,{"$f":"Réglages!$F$54","v":"Enjeu de travail secondaire de cette leçon >"},null,null,null,null,null,"",null,null,null,null,null,null,null,{"$f":"IF(Y56=\"\",\"\",IF(Y56=$AZ$40,$AZ$35,IF(Y56=$BA$40,$BA$35,IF(Y56=$BB$40,$BB$35,IF(Y56=$BC$40,$BC$35,IF(Y56=$BD$40,$BD$35,IF(Y56=$BE$40,$BE$35,IF(Y56=$BF$40,$BF$35,$BG$35))))))))","v":""},null,{"$f":"Réglages!$H$50","v":"Critères rappel >"},null,"C1 j",null,{"$f":"Réglages!$H$51","v":"Je me situe >"},null,null,null,{"$f":"IF(AK56=\"\",\"\",ISNUMBER(MATCH(AK56,IF(AT56=1,$AZ$35:$AZ$38,IF(AT56=2,$BA$35:$BA$38,IF(AT56=3,$BB$35:$BB$38,IF(AT56=4,$BC$35:$BC$38,IF(AT56=5,$BD$35:$BD$38,IF(AW$5=6,$BE$35:$BE$38,IF(AT56=7,$BF$35:$BF$38,IF(AT56=8,$BG$35:$BG$38,1)))))))),0)))","v":false},null,{"$f":"IF(Y56=\"\",\"\",INDEX($AZ$10:$BG$10,MATCH(Y56,$AZ$8:$BG$8,0)))","v":""},{"$f":"VALUE(RIGHT(AS56,1))","v":{"$error":"#VALUE!"}},null,"SI(AE35=AZ39;AZ35:AZ38;SI(AE35=BA39;BA35:BA38;SI(AE35=Bb39;Bb35:Bb38;SI(AE35=Bc39;Bc35:Bc38;SI(AE35=Bd39;Bd35:Bd38;SI(AE35=Be39;Be35:Be38;SI(AE35=Bf39;Bf35:Bf38;SI(AE35=Bg39;Bg35:Bg38;AY35:AY38))))))))",null,null,"c2",{"$f":"IF(Réglages!$B$15=\"\",\"\",\"C2 \"&Réglages!$B$15)","v":"C2 99 points"},{"$f":"IF(Réglages!$C$15=\"\",\"\",\"C2 \"&Réglages!$C$15)","v":""},{"$f":"IF(Réglages!$D$15=\"\",\"\",\"C2 \"&Réglages!$D$15)","v":""},{"$f":"IF(Réglages!$E$15=\"\",\"\",\"C2 \"&Réglages!$E$15)","v":""},{"$f":"IF(Réglages!$F$15=\"\",\"\",\"C2 \"&Réglages!$F$15)","v":""},{"$f":"IF(Réglages!$G$15=\"\",\"\",\"C2 \"&Réglages!$G$15)","v":""},{"$f":"IF(Réglages!$H$15=\"\",\"\",\"C2 \"&Réglages!$H$15)","v":""},{"$f":"IF(Réglages!$I$15=\"\",\"\",\"C2 \"&Réglages!$I$15)","v":""}]
[null,null,null,null,null,null,null,null,null,null,null,null,null,null,null,null,null,null,{"$f":" Réglages!$H$52&AR43&\" >\"","v":"Mon Projet pour L3 >"},null,null,null,null,null,null,null,null,null,null,null,null,null,null,null,null,null,null,null,{"$f":"Réglages!$H$53&AR43&\" >\"","v":"Mon Axe Pioritaire en L3 >"},null,"",null,null,null,null,null,null,null,null,null,"c3",{"$f":"IF(Réglages!$B$16=\"\",\"\",\"C3 \"&Réglages!$B$16)","v":"C3 999 pts "},{"$f":"IF(Réglages!$C$16=\"\",\"\",\"C3 \"&Réglages!$C$16)","v":""},{"$f":"IF(Réglages!$D$16=\"\",\"\",\"C3 \"&Réglages!$D$16)","v":""},{"$f":"IF(Réglages!$E$16=\"\",\"\",\"C3 \"&Réglages!$E$16)","v":""},{"$f":"IF(Réglages!$F$16=\"\",\"\",\"C3 \"&Réglages!$F$16)","v":""},{"$f":"IF(Réglages!$G$16=\"\",\"\",\"C3 \"&Réglages!$G$16)","v":""},{"$f":"IF(Réglages!$H$16=\"\",\"\",\"C3 \"&Réglages!$H$16)","v":""},{"$f":"IF(Réglages!$I$16=\"\",\"\",\"C3 \"&Réglages!$I$16)","v":""}]
[null,null,null,null,null,null,null,null,null,null,null,null,null,null,null,null,null,null,null,null,null,null,null,null,null,null,null,null,null,null,null,null,null,null,null,null,null,null,null,null,null,null,null,null,null,null,null,null,null,null,"c4",{"$f":"IF(Réglages!$B$17=\"\",\"\",\"C4 \"&Réglages!$B$17)","v":"C4 9999 pts"},{"$f":"IF(Réglages!$C$17=\"\",\"\",\"C4 \"&Réglages!$C$17)","v":""},{"$f":"IF(Réglages!$D$17=\"\",\"\",\"C4 \"&Réglages!$D$17)","v":""},{"$f":"IF(Réglages!$E$17=\"\",\"\",\"C4 \"&Réglages!$E$17)","v":""},{"$f":"IF(Réglages!$F$17=\"\",\"\",\"C4 \"&Réglages!$F$17)","v":""},{"$f":"IF(Réglages!$G$17=\"\",\"\",\"C4 \"&Réglages!$G$17)","v":""},{"$f":"IF(Réglages!$H$17=\"\",\"\",\"C4 \"&Réglages!$H$17)","v":""},{"$f":"IF(Réglages!$I$17=\"\",\"\",\"C4 \"&Réglages!$I$17)","v":""}]
[null,null,null,null,null,null,null,null,null,null,null,null,null,null,null,null,null,null,null,null,null,null,null,null,null,null,null,null,null,null,null,null,null,null,null,null,null,null,null,null,null,null,null,null,null,null,null,null,null,null,{"$f":"Réglages!$L$5","v":"Moteur "},{"$f":"IF($AZ$8=\"\",\"\",$AZ$8)","v":"Le serveur "},{"$f":"IF($BA$8=\"\",\"\",$BA$8)","v":"Observateur"},{"$f":"IF($BB$8=\"\",\"\",$BB$8)","v":"?"},{"$f":"IF($BC$8=\"\",\"\",$BC$8)","v":""},{"$f":"IF($BD$8=\"\",\"\",$BD$8)","v":""},{"$f":"IF($BE$8=\"\",\"\",$BE$8)","v":""},{"$f":"IF($BF$8=\"\",\"\",$BF$8)","v":""},{"$f":"IF($BG$8=\"\",\"\",$BG$8)","v":""}]
[null,null,null,null,null,null,null,null,null,null,null,null,null,null,null,null,null,null,null,null,null,null,null,null,null,null,null,null,null,null,null,null,null,null,null,null,null,null,null,null,null,null,null,null,null,null,null,null,null,null,{"$f":"Réglages!$L$6","v":"Non moteur"},{"$f":"IF($AZ$8=\"\",\"\",$AZ$8)","v":"Le serveur "},{"$f":"IF($BA$8=\"\",\"\",$BA$8)","v":"Observateur"},{"$f":"IF($BB$8=\"\",\"\",$BB$8)","v":"?"},{"$f":"IF($BC$8=\"\",\"\",$BC$8)","v":""},{"$f":"IF($BD$8=\"\",\"\",$BD$8)","v":""},{"$f":"IF($BE$8=\"\",\"\",$BE$8)","v":""},{"$f":"IF($BF$8=\"\",\"\",$BF$8)","v":""},{"$f":"IF($BG$8=\"\",\"\",$BG$8)","v":""}]
[]
[]
[null,null,null,null,null,null,null,null,null,null,null,null,null,null,null,null,null,"Leçon 3",null,null,null,null,null,null,null,null,null,null,null,null,null,null,null,null,null,null,null,null,null,null,null,null,null,{"$f":"RIGHT(R63,1)+1","v":4},{"$f":"MATCH(AG65,IF(AW65=1,AZ52:AZ61,IF(AW65=2,BA52:BA61,1)),0)","v":{"$error":"#VALUE!"}},{"$f":"OR(AND(AW65=1,MATCH(AG65,AZ52:AZ61,0)),(AND(AW65=2,MATCH(AG65,BA52:BA61,0))))","v":{"$error":"#VALUE!"}}]
[null,null,null,null,null,null,null,null,null,null,null,null,null,null,null,null,null,null,{"$f":"Réglages!$D$54","v":"Axes de Travail "},null,null,null,null,null,null,null,null,null,null,null,null,null,{"$f":"Réglages!$F$50","v":"Situations d'apprentissage"},null,null,null,{"$f":"Réglages!$F$51","v":"Résultats "},null,{"$f":"Réglages!$F$52","v":"Je me projette"},null,null,null,null,-1,0,1,"réf",null,"n colonne","n ligne "]
[null,null,null,null,null,null,null,null,null,null,null,null,null,null,null,null,null,null,"",null,null,null,null,null,null,null,null,null,{"$f":"IF(S65=\"\",\"\",INDEX($AZ$10:$BG$10,MATCH(S65,$AZ$8:$BG$8,0)))","v":""},null,null,null,null,null,null,null,null,null,"3/ sit3",null,null,null,{"$f":"IF(AG65=\"\",\"\",ISNUMBER(MATCH(AG65,IF(AW65=1,$AZ$12:$AZ$26,IF(AW65=2,$BA$12:$BA$26,IF(AW65=3,$BB$12:$BB$26,IF(AW65=4,$BC$12:$BC$26,IF(AW65=5,$BD$12:$BD$26,IF(AW$5=6,$BE$12:$BE$26,IF(AW65=7,$BF$12:$BF$26,IF(AW65=8,$BG$12:$BG$26,1)))))))),0)))","v":""},{"$f":"IFERROR(INDEX($AZ$12:$BG$26,AX65-1,AW65),\"\")","v":""},{"$f":"IFERROR(INDEX($AZ$12:$BG$26,AX65,AW65),\"\")","v":""},{"$f":"IFERROR(INDEX($AZ$12:$BG$26,AX65+1,AW65),\"\")","v":""},"Sit de Réf",null,{"$f":"VALUE(RIGHT(AC65,1))","v":{"$error":"#VALUE!"}},{"$f":"VALUE(LEFT(AG65,2))","v":{"$error":"#VALUE!"}},{"$f":"IF(AM65=\"\",\"\",IF(AM65=AU65,AU65,ISNUMBER(MATCH(AM65,IF(AW65=1,$AZ$12:$AZ$26,IF(AW65=2,$BA$12:$BA$26,IF(AW65=3,$BB$12:$BB$26,IF(AW65=4,$BC$12:$BC$26,IF(AW65=5,$BD$12:$BD$26,IF(AW$5=6,$BE$12:$BE$26,IF(AW65=7,$BF$12:$BF$26,IF(AW65=8,$BG$12:$BG$26,1)))))))),0))))","v":false}]
[null,null,null,null,null,null,null,null,null,null,null,null,null,null,null,null,null,null,"",null,null,null,null,null,null,null,null,null,"",null,null,null,null,null,null,null,null,null,null,null,null,null,{"$f":"IF(AG66=\"\",\"\",ISNUMBER(MATCH(AG66,IF(AW66=1,$AZ$12:$AZ$26,IF(AW66=2,$BA$12:$BA$26,IF(AW66=3,$BB$12:$BB$26,IF(AW66=4,$BC$12:$BC$26,IF(AW66=5,$BD$12:$BD$26,IF(AW$5=6,$BE$12:$BE$26,IF(AW66=7,$BF$12:$BF$26,IF(AW66=8,$BG$12:$BG$26,1)))))))),0)))","v":""},{"$f":"IFERROR(INDEX($AZ$12:$BG$26,AX66-1,AW66),\"\")","v":""},{"$f":"IFERROR(INDEX($AZ$12:$BG$26,AX66,AW66),\"\")","v":""},{"$f":"IFERROR(INDEX($AZ$12:$BG$26,AX66+1,AW66),\"\")","v":""},"Sit de Réf",null,{"$error":"#VALUE!"},{"$f":"VALUE(LEFT(AG66,2))","v":{"$error":"#VALUE!"}},{"$f":"IF(AM66=\"\",\"\",IF(AM66=AU66,AU66,ISNUMBER(MATCH(AM66,IF(AW66=1,$AZ$12:$AZ$26,IF(AW66=2,$BA$12:$BA$26,IF(AW66=3,$BB$12:$BB$26,IF(AW66=4,$BC$12:$BC$26,IF(AW66=5,$BD$12:$BD$26,IF(AW$5=6,$BE$12:$BE$26,IF(AW66=7,$BF$12:$BF$26,IF(AW66=8,$BG$12:$BG$26,1)))))))),0))))","v":""}]
[null,null,null,null,null,null,null,null,null,null,null,null,null,null,null,null,null,null,"",null,null,null,null,null,null,null,null,null,"",null,null,null,null,null,null,null,null,null,null,null,null,null,"","","","","Sit de Réf",null,{"$error":"#VALUE!"},{"$error":"#VALUE!"},""]
[null,null,null,null,null,null,null,null,null,null,null,null,null,null,null,null,null,null,"",null,null,null,null,null,null,null,null,null,"",null,null,null,null,null,null,null,null,null,null,null,null,null,"","","","","Sit de Réf",null,{"$error":"#VALUE!"},{"$error":"#VALUE!"},""]
[null,null,null,null,null,null,null,null,null,null,null,null,null,null,null,null,null,null,"",null,null,null,null,null,null,null,null,null,"",null,null,null,null,null,null,null,null,null,null,null,null,null,"","","","","Sit de Réf",null,{"$error":"#VALUE!"},{"$error":"#VALUE!"},""]
[null,null,null,null,null,null,null,null,null,null,null,null,null,null,null,null,null,null,"",null,null,null,null,null,null,null,null,null,"",null,null,null,null,null,null,null,null,null,null,null,null,null,"","","","","Sit de Réf",null,{"$error":"#VALUE!"},{"$error":"#VALUE!"},""]
[null,null,null,null,null,null,null,null,null,null,null,null,null,null,null,null,null,null,"",null,null,null,null,null,null,null,null,null,"",null,null,null,null,null,null,null,null,null,null,null,null,null,"","","","","Sit de Réf",null,{"$error":"#VALUE!"},{"$error":"#VALUE!"},""]
[null,null,null,null,null,null,null,null,null,null,null,null,null,null,null,null,null,null,"",null,null,null,null,null,null,null,null,null,"",null,null,null,null,null,null,null,null,null,null,null,null,null,"","","","","Sit de Réf",null,{"$error":"#VALUE!"},{"$error":"#VALUE!"},""]
[null,null,null,null,null,null,null,null,null,null,null,null,null,null,null,null,null,null,"",null,null,null,null,null,null,null,null,null,"",null,null,null,null,null,null,null,null,null,null,null,null,null,"","","","","Sit de Réf",null,{"$error":"#VALUE!"},{"$error":"#VALUE!"},"",{"$f":"$AZ$9","v":"Moteur "},{"$f":"$BA$9","v":"Non moteur"},{"$f":"$BB$9","v":"Quel enjeu ?"},{"$f":"$BC$9","v":""},{"$f":"$BD$9","v":""},{"$f":"$BE$9","v":""},{"$f":"$BF$9","v":""},{"$f":"$BG$9","v":""}]
[null,null,null,null,null,null,null,null,null,null,null,null,null,null,null,null,null,null,"",null,null,null,null,null,null,null,null,null,"",null,null,null,null,null,null,null,null,null,null,null,null,null,"","","","","Sit de Réf",null,{"$error":"#VALUE!"},{"$error":"#VALUE!"},"",{"$f":"IF(Réglages!$B$12=\"\",\"\",\"Sit de Réf :  \"&Réglages!$B$12)","v":"Sit de Réf :  Le sablier"},{"$f":"IF(Réglages!$C$12=\"\",\"\",\"Sit de Réf :  \"&Réglages!$C$12)","v":""},{"$f":"IF(Réglages!$D$12=\"\",\"\",\"Sit de Réf :  \"&Réglages!$D$12)","v":""},{"$f":"IF(Réglages!$E$12=\"\",\"\",\"Sit de Réf :  \"&Réglages!$E$12)","v":""},{"$f":"IF(Réglages!$F$12=\"\",\"\",\"Sit de Réf :  \"&Réglages!$F$12)","v":""},{"$f":"IF(Réglages!$G$12=\"\",\"\",\"Sit de Réf :  \"&Réglages!$G$12)","v":""},{"$f":"IF(Réglages!$H$12=\"\",\"\",\"Sit de Réf :  \"&Réglages!$H$12)","v":""},{"$f":"IF(Réglages!$I$12=\"\",\"\",\"Sit de Réf :  \"&Réglages!$I$12)","v":""}]
[null,null,null,null,null,null,null,null,null,null,null,null,null,null,null,null,null,null,{"$f":"Réglages!$F$53","v":"Enjeu de travail principal de cette leçon >"},null,null,null,null,null,"",null,null,null,null,null,null,null,{"$f":"IF(Y75=\"\",\"\",IF(Y75=$AZ$39,$AZ$34,IF(Y75=$BA$39,$BA$34,IF(Y75=$BB$39,$BB$34,IF(Y75=$BC$39,$BC$34,IF(Y75=$BD$39,$BD$34,IF(Y75=$BE$39,$BE$34,IF(Y75=$BF$39,$BF$34,$BG$34))))))))","v":""},null,{"$f":"Réglages!$H$50","v":"Critères rappel >"},null,"c3",null,{"$f":"Réglages!$H$51","v":"Je me situe >"},null,null,null,{"$f":"IF(AK75=\"\",\"\",ISNUMBER(MATCH(AK75,IF(AT75=1,$AZ$35:$AZ$38,IF(AT75=2,$BA$35:$BA$38,IF(AT75=3,$BB$35:$BB$38,IF(AT75=4,$BC$35:$BC$38,IF(AT75=5,$BD$35:$BD$38,IF(AW$5=6,$BE$35:$BE$38,IF(AT75=7,$BF$35:$BF$38,IF(AT75=8,$BG$35:$BG$38,1)))))))),0)))","v":false},"droite axe !!!!",{"$f":"IF(Y75=\"\",\"\",INDEX($AZ$10:$BG$10,MATCH(Y75,$AZ$8:$BG$8,0)))","v":""},{"$f":"VALUE(RIGHT(AS75,1))","v":{"$error":"#VALUE!"}},null,null,null,null,"c1",{"$f":"IF(Réglages!$B$14=\"\",\"\",\"C1 \"&Réglages!$B$14)","v":"C1 9 points"},{"$f":"IF(Réglages!$C$14=\"\",\"\",\"C1 \"&Réglages!$C$14)","v":""},{"$f":"IF(Réglages!$D$14=\"\",\"\",\"C1 \"&Réglages!$D$14)","v":""},{"$f":"IF(Réglages!$E$14=\"\",\"\",\"C1 \"&Réglages!$E$14)","v":""},{"$f":"IF(Réglages!$F$14=\"\",\"\",\"C1 \"&Réglages!$F$14)","v":""},{"$f":"IF(Réglages!$G$14=\"\",\"\",\"C1 \"&Réglages!$G$14)","v":""},{"$f":"IF(Réglages!$H$14=\"\",\"\",\"C1 \"&Réglages!$H$14)","v":""},{"$f":"IF(Réglages!$I$14=\"\",\"\",\"C1 \"&Réglages!$I$14)","v":""}]
[null,null,null,null,null,null,null,null,null,null,null,null,null,null,null,null,null,null,{"$f":"Réglages!$F$54","v":"Enjeu de travail secondaire de cette leçon >"},null,null,null,null,null,"",null,null,null,null,null,null,null,{"$f":"IF(Y76=\"\",\"\",IF(Y76=$AZ$40,$AZ$35,IF(Y76=$BA$40,$BA$35,IF(Y76=$BB$40,$BB$35,IF(Y76=$BC$40,$BC$35,IF(Y76=$BD$40,$BD$35,IF(Y76=$BE$40,$BE$35,IF(Y76=$BF$40,$BF$35,$BG$35))))))))","v":""},null,{"$f":"Réglages!$H$50","v":"Critères rappel >"},null,"C1 j",null,{"$f":"Réglages!$H$51","v":"Je me situe >"},null,null,null,{"$f":"IF(AK76=\"\",\"\",ISNUMBER(MATCH(AK76,IF(AT76=1,$AZ$35:$AZ$38,IF(AT76=2,$BA$35:$BA$38,IF(AT76=3,$BB$35:$BB$38,IF(AT76=4,$BC$35:$BC$38,IF(AT76=5,$BD$35:$BD$38,IF(AW$5=6,$BE$35:$BE$38,IF(AT76=7,$BF$35:$BF$38,IF(AT76=8,$BG$35:$BG$38,1)))))))),0)))","v":false},null,{"$f":"IF(Y76=\"\",\"\",INDEX($AZ$10:$BG$10,MATCH(Y76,$AZ$8:$BG$8,0)))","v":""},{"$f":"VALUE(RIGHT(AS76,1))","v":{"$error":"#VALUE!"}},null,"SI(AE35=AZ39;AZ35:AZ38;SI(AE35=BA39;BA35:BA38;SI(AE35=Bb39;Bb35:Bb38;SI(AE35=Bc39;Bc35:Bc38;SI(AE35=Bd39;Bd35:Bd38;SI(AE35=Be39;Be35:Be38;SI(AE35=Bf39;Bf35:Bf38;SI(AE35=Bg39;Bg35:Bg38;AY35:AY38))))))))",null,null,"c2",{"$f":"IF(Réglages!$B$15=\"\",\"\",\"C2 \"&Réglages!$B$15)","v":"C2 99 points"},{"$f":"IF(Réglages!$C$15=\"\",\"\",\"C2 \"&Réglages!$C$15)","v":""},{"$f":"IF(Réglages!$D$15=\"\",\"\",\"C2 \"&Réglages!$D$15)","v":""},{"$f":"IF(Réglages!$E$15=\"\",\"\",\"C2 \"&Réglages!$E$15)","v":""},{"$f":"IF(Réglages!$F$15=\"\",\"\",\"C2 \"&Réglages!$F$15)","v":""},{"$f":"IF(Réglages!$G$15=\"\",\"\",\"C2 \"&Réglages!$G$15)","v":""},{"$f":"IF(Réglages!$H$15=\"\",\"\",\"C2 \"&Réglages!$H$15)","v":""},{"$f":"IF(Réglages!$I$15=\"\",\"\",\"C2 \"&Réglages!$I$15)","v":""}]
[null,null,null,null,null,null,null,null,null,null,null,null,null,null,null,null,null,null,{"$f":" Réglages!$H$52&AR63&\" >\"","v":"Mon Projet pour L4 >"},null,null,null,null,null,null,null,null,null,null,null,null,null,null,null,null,null,null,null,{"$f":"Réglages!$H$53&AR63&\" >\"","v":"Mon Axe Pioritaire en L4 >"},null,"",null,null,null,null,null,null,null,null,null,"c3",{"$f":"IF(Réglages!$B$16=\"\",\"\",\"C3 \"&Réglages!$B$16)","v":"C3 999 pts "},{"$f":"IF(Réglages!$C$16=\"\",\"\",\"C3 \"&Réglages!$C$16)","v":""},{"$f":"IF(Réglages!$D$16=\"\",\"\",\"C3 \"&Réglages!$D$16)","v":""},{"$f":"IF(Réglages!$E$16=\"\",\"\",\"C3 \"&Réglages!$E$16)","v":""},{"$f":"IF(Réglages!$F$16=\"\",\"\",\"C3 \"&Réglages!$F$16)","v":""},{"$f":"IF(Réglages!$G$16=\"\",\"\",\"C3 \"&Réglages!$G$16)","v":""},{"$f":"IF(Réglages!$H$16=\"\",\"\",\"C3 \"&Réglages!$H$16)","v":""},{"$f":"IF(Réglages!$I$16=\"\",\"\",\"C3 \"&Réglages!$I$16)","v":""}]
[null,null,null,null,null,null,null,null,null,null,null,null,null,null,null,null,null,null,null,null,null,null,null,null,null,null,null,null,null,null,null,null,null,null,null,null,null,null,null,null,null,null,null,null,null,null,null,null,null,null,"c4",{"$f":"IF(Réglages!$B$17=\"\",\"\",\"C4 \"&Réglages!$B$17)","v":"C4 9999 pts"},{"$f":"IF(Réglages!$C$17=\"\",\"\",\"C4 \"&Réglages!$C$17)","v":""},{"$f":"IF(Réglages!$D$17=\"\",\"\",\"C4 \"&Réglages!$D$17)","v":""},{"$f":"IF(Réglages!$E$17=\"\",\"\",\"C4 \"&Réglages!$E$17)","v":""},{"$f":"IF(Réglages!$F$17=\"\",\"\",\"C4 \"&Réglages!$F$17)","v":""},{"$f":"IF(Réglages!$G$17=\"\",\"\",\"C4 \"&Réglages!$G$17)","v":""},{"$f":"IF(Réglages!$H$17=\"\",\"\",\"C4 \"&Réglages!$H$17)","v":""},{"$f":"IF(Réglages!$I$17=\"\",\"\",\"C4 \"&Réglages!$I$17)","v":""}]
[null,null,null,null,null,null,null,null,null,null,null,null,null,null,null,null,null,null,null,null,null,null,null,null,null,null,null,null,null,null,null,null,null,null,null,null,null,null,null,null,null,null,null,null,null,null,null,null,null,null,{"$f":"Réglages!$L$5","v":"Moteur "},{"$f":"IF($AZ$8=\"\",\"\",$AZ$8)","v":"Le serveur "},{"$f":"IF($BA$8=\"\",\"\",$BA$8)","v":"Observateur"},{"$f":"IF($BB$8=\"\",\"\",$BB$8)","v":"?"},{"$f":"IF($BC$8=\"\",\"\",$BC$8)","v":""},{"$f":"IF($BD$8=\"\",\"\",$BD$8)","v":""},{"$f":"IF($BE$8=\"\",\"\",$BE$8)","v":""},{"$f":"IF($BF$8=\"\",\"\",$BF$8)","v":""},{"$f":"IF($BG$8=\"\",\"\",$BG$8)","v":""}]
[null,null,null,null,null,null,null,null,null,null,null,null,null,null,null,null,null,null,null,null,null,null,null,null,null,null,null,null,null,null,null,null,null,null,null,null,null,null,null,null,null,null,null,null,null,null,null,null,null,null,{"$f":"Réglages!$L$6","v":"Non moteur"},{"$f":"IF($AZ$8=\"\",\"\",$AZ$8)","v":"Le serveur "},{"$f":"IF($BA$8=\"\",\"\",$BA$8)","v":"Observateur"},{"$f":"IF($BB$8=\"\",\"\",$BB$8)","v":"?"},{"$f":"IF($BC$8=\"\",\"\",$BC$8)","v":""},{"$f":"IF($BD$8=\"\",\"\",$BD$8)","v":""},{"$f":"IF($BE$8=\"\",\"\",$BE$8)","v":""},{"$f":"IF($BF$8=\"\",\"\",$BF$8)","v":""},{"$f":"IF($BG$8=\"\",\"\",$BG$8)","v":""}]
[]
[]
["Leçon 4",null,null,null,null,null,null,null,null,null,null,null,null,null,null,null,null,null,null,null,null,null,null,null,null,null,null,null,null,null,null,null,null,null,null,null,null,null,null,null,null,null,null,{"$f":"RIGHT(A83,1)+1","v":5},{"$f":"MATCH(AG85,IF(AW85=1,AZ72:AZ81,IF(AW85=2,BA72:BA81,1)),0)","v":{"$error":"#VALUE!"}},{"$f":"OR(AND(AW85=1,MATCH(AG85,AZ72:AZ81,0)),(AND(AW85=2,MATCH(AG85,BA72:BA81,0))))","v":{"$error":"#VALUE!"}}]
[null,null,null,null,null,null,null,null,null,null,null,null,null,null,null,null,null,null,{"$f":"Réglages!$D$54","v":"Axes de Travail "},null,null,null,null,null,null,null,null,null,null,null,null,null,{"$f":"Réglages!$F$50","v":"Situations d'apprentissage"},null,null,null,{"$f":"Réglages!$F$51","v":"Résultats "},null,{"$f":"Réglages!$F$52","v":"Je me projette"},null,null,null,null,-1,0,1,"réf",null,"n colonne","n ligne "]
[null,null,null,null,null,null,null,null,null,null,null,null,null,null,null,null,null,null,"",null,null,null,null,null,null,null,null,null,{"$f":"IF(S85=\"\",\"\",INDEX($AZ$10:$BG$10,MATCH(S85,$AZ$8:$BG$8,0)))","v":""},null,null,null,null,null,null,null,null,null,"3/ sit3",null,null,null,{"$f":"IF(AG85=\"\",\"\",ISNUMBER(MATCH(AG85,IF(AW85=1,$AZ$12:$AZ$26,IF(AW85=2,$BA$12:$BA$26,IF(AW85=3,$BB$12:$BB$26,IF(AW85=4,$BC$12:$BC$26,IF(AW85=5,$BD$12:$BD$26,IF(AW$5=6,$BE$12:$BE$26,IF(AW85=7,$BF$12:$BF$26,IF(AW85=8,$BG$12:$BG$26,1)))))))),0)))","v":""},{"$f":"IFERROR(INDEX($AZ$12:$BG$26,AX85-1,AW85),\"\")","v":""},{"$f":"IFERROR(INDEX($AZ$12:$BG$26,AX85,AW85),\"\")","v":""},{"$f":"IFERROR(INDEX($AZ$12:$BG$26,AX85+1,AW85),\"\")","v":""},"Sit de Réf",null,{"$f":"VALUE(RIGHT(AC85,1))","v":{"$error":"#VALUE!"}},{"$f":"VALUE(LEFT(AG85,2))","v":{"$error":"#VALUE!"}},{"$f":"IF(AM85=\"\",\"\",IF(AM85=AU85,AU85,ISNUMBER(MATCH(AM85,IF(AW85=1,$AZ$12:$AZ$26,IF(AW85=2,$BA$12:$BA$26,IF(AW85=3,$BB$12:$BB$26,IF(AW85=4,$BC$12:$BC$26,IF(AW85=5,$BD$12:$BD$26,IF(AW$5=6,$BE$12:$BE$26,IF(AW85=7,$BF$12:$BF$26,IF(AW85=8,$BG$12:$BG$26,1)))))))),0))))","v":false}]
[null,null,null,null,null,null,null,null,null,null,null,null,null,null,null,null,null,null,"",null,null,null,null,null,null,null,null,null,"",null,null,null,null,null,null,null,null,null,null,null,null,null,{"$f":"IF(AG86=\"\",\"\",ISNUMBER(MATCH(AG86,IF(AW86=1,$AZ$12:$AZ$26,IF(AW86=2,$BA$12:$BA$26,IF(AW86=3,$BB$12:$BB$26,IF(AW86=4,$BC$12:$BC$26,IF(AW86=5,$BD$12:$BD$26,IF(AW$5=6,$BE$12:$BE$26,IF(AW86=7,$BF$12:$BF$26,IF(AW86=8,$BG$12:$BG$26,1)))))))),0)))","v":""},{"$f":"IFERROR(INDEX($AZ$12:$BG$26,AX86-1,AW86),\"\")","v":""},{"$f":"IFERROR(INDEX($AZ$12:$BG$26,AX86,AW86),\"\")","v":""},{"$f":"IFERROR(INDEX($AZ$12:$BG$26,AX86+1,AW86),\"\")","v":""},"Sit de Réf",null,{"$error":"#VALUE!"},{"$f":"VALUE(LEFT(AG86,2))","v":{"$error":"#VALUE!"}},{"$f":"IF(AM86=\"\",\"\",IF(AM86=AU86,AU86,ISNUMBER(MATCH(AM86,IF(AW86=1,$AZ$12:$AZ$26,IF(AW86=2,$BA$12:$BA$26,IF(AW86=3,$BB$12:$BB$26,IF(AW86=4,$BC$12:$BC$26,IF(AW86=5,$BD$12:$BD$26,IF(AW$5=6,$BE$12:$BE$26,IF(AW86=7,$BF$12:$BF$26,IF(AW86=8,$BG$12:$BG$26,1)))))))),0))))","v":""}]
[null,null,null,null,null,null,null,null,null,null,null,null,null,null,null,null,null,null,"",null,null,null,null,null,null,null,null,null,"",null,null,null,null,null,null,null,null,null,null,null,null,null,"","","","","Sit de Réf",null,{"$error":"#VALUE!"},{"$error":"#VALUE!"},""]
[null,null,null,null,null,null,null,null,null,null,null,null,null,null,null,null,null,null,"",null,null,null,null,null,null,null,null,null,"",null,null,null,null,null,null,null,null,null,null,null,null,null,"","","","","Sit de Réf",null,{"$error":"#VALUE!"},{"$error":"#VALUE!"},""]
[null,null,null,null,null,null,null,null,null,null,null,null,null,null,null,null,null,null,"",null,null,null,null,null,null,null,null,null,"",null,null,null,null,null,null,null,null,null,null,null,null,null,"","","","","Sit de Réf",null,{"$error":"#VALUE!"},{"$error":"#VALUE!"},""]
[null,null,null,null,null,null,null,null,null,null,null,null,null,null,null,null,null,null,"",null,null,null,null,null,null,null,null,null,"",null,null,null,null,null,null,null,null,null,null,null,null,null,"","","","","Sit de Réf",null,{"$error":"#VALUE!"},{"$error":"#VALUE!"},""]
[null,null,null,null,null,null,null,null,null,null,null,null,null,null,null,null,null,null,"",null,null,null,null,null,null,null,null,null,"",null,null,null,null,null,null,null,null,null,null,null,null,null,"","","","","Sit de Réf",null,{"$error":"#VALUE!"},{"$error":"#VALUE!"},""]
[null,null,null,null,null,null,null,null,null,null,null,null,null,null,null,null,null,null,"",null,null,null,null,null,null,null,null,null,"",null,null,null,null,null,null,null,null,null,null,null,null,null,"","","","","Sit de Réf",null,{"$error":"#VALUE!"},{"$error":"#VALUE!"},""]
[null,null,null,null,null,null,null,null,null,null,null,null,null,null,null,null,null,null,"",null,null,null,null,null,null,null,null,null,"",null,null,null,null,null,null,null,null,null,null,null,null,null,"","","","","Sit de Réf",null,{"$error":"#VALUE!"},{"$error":"#VALUE!"},"",{"$f":"$AZ$9","v":"Moteur "},{"$f":"$BA$9","v":"Non moteur"},{"$f":"$BB$9","v":"Quel enjeu ?"},{"$f":"$BC$9","v":""},{"$f":"$BD$9","v":""},{"$f":"$BE$9","v":""},{"$f":"$BF$9","v":""},{"$f":"$BG$9","v":""}]
[null,null,null,null,null,null,null,null,null,null,null,null,null,null,null,null,null,null,"",null,null,null,null,null,null,null,null,null,"",null,null,null,null,null,null,null,null,null,null,null,null,null,"","","","","Sit de Réf",null,{"$error":"#VALUE!"},{"$error":"#VALUE!"},"",{"$f":"IF(Réglages!$B$12=\"\",\"\",\"Sit de Réf :  \"&Réglages!$B$12)","v":"Sit de Réf :  Le sablier"},{"$f":"IF(Réglages!$C$12=\"\",\"\",\"Sit de Réf :  \"&Réglages!$C$12)","v":""},{"$f":"IF(Réglages!$D$12=\"\",\"\",\"Sit de Réf :  \"&Réglages!$D$12)","v":""},{"$f":"IF(Réglages!$E$12=\"\",\"\",\"Sit de Réf :  \"&Réglages!$E$12)","v":""},{"$f":"IF(Réglages!$F$12=\"\",\"\",\"Sit de Réf :  \"&Réglages!$F$12)","v":""},{"$f":"IF(Réglages!$G$12=\"\",\"\",\"Sit de Réf :  \"&Réglages!$G$12)","v":""},{"$f":"IF(Réglages!$H$12=\"\",\"\",\"Sit de Réf :  \"&Réglages!$H$12)","v":""},{"$f":"IF(Réglages!$I$12=\"\",\"\",\"Sit de Réf :  \"&Réglages!$I$12)","v":""}]
[null,null,null,null,null,null,null,null,null,null,null,null,null,null,null,null,null,null,{"$f":"Réglages!$F$53","v":"Enjeu de travail principal de cette leçon >"},null,null,null,null,null,"",null,null,null,null,null,null,null,{"$f":"IF(Y95=\"\",\"\",IF(Y95=$AZ$39,$AZ$34,IF(Y95=$BA$39,$BA$34,IF(Y95=$BB$39,$BB$34,IF(Y95=$BC$39,$BC$34,IF(Y95=$BD$39,$BD$34,IF(Y95=$BE$39,$BE$34,IF(Y95=$BF$39,$BF$34,$BG$34))))))))","v":""},null,{"$f":"Réglages!$H$50","v":"Critères rappel >"},null,"C2 fggzev",null,{"$f":"Réglages!$H$51","v":"Je me situe >"},null,null,null,{"$f":"IF(AK95=\"\",\"\",ISNUMBER(MATCH(AK95,IF(AT95=1,$AZ$35:$AZ$38,IF(AT95=2,$BA$35:$BA$38,IF(AT95=3,$BB$35:$BB$38,IF(AT95=4,$BC$35:$BC$38,IF(AT95=5,$BD$35:$BD$38,IF(AW$5=6,$BE$35:$BE$38,IF(AT95=7,$BF$35:$BF$38,IF(AT95=8,$BG$35:$BG$38,1)))))))),0)))","v":false},"droite axe !!!!",{"$f":"IF(Y95=\"\",\"\",INDEX($AZ$10:$BG$10,MATCH(Y95,$AZ$8:$BG$8,0)))","v":""},{"$f":"VALUE(RIGHT(AS95,1))","v":{"$error":"#VALUE!"}},null,null,null,null,"c1",{"$f":"IF(Réglages!$B$14=\"\",\"\",\"C1 \"&Réglages!$B$14)","v":"C1 9 points"},{"$f":"IF(Réglages!$C$14=\"\",\"\",\"C1 \"&Réglages!$C$14)","v":""},{"$f":"IF(Réglages!$D$14=\"\",\"\",\"C1 \"&Réglages!$D$14)","v":""},{"$f":"IF(Réglages!$E$14=\"\",\"\",\"C1 \"&Réglages!$E$14)","v":""},{"$f":"IF(Réglages!$F$14=\"\",\"\",\"C1 \"&Réglages!$F$14)","v":""},{"$f":"IF(Réglages!$G$14=\"\",\"\",\"C1 \"&Réglages!$G$14)","v":""},{"$f":"IF(Réglages!$H$14=\"\",\"\",\"C1 \"&Réglages!$H$14)","v":""},{"$f":"IF(Réglages!$I$14=\"\",\"\",\"C1 \"&Réglages!$I$14)","v":""}]
[null,null,null,null,null,null,null,null,null,null,null,null,null,null,null,null,null,null,{"$f":"Réglages!$F$54","v":"Enjeu de travail secondaire de cette leçon >"},null,null,null,null,null,"",null,null,null,null,null,null,null,{"$f":"IF(Y96=\"\",\"\",IF(Y96=$AZ$40,$AZ$35,IF(Y96=$BA$40,$BA$35,IF(Y96=$BB$40,$BB$35,IF(Y96=$BC$40,$BC$35,IF(Y96=$BD$40,$BD$35,IF(Y96=$BE$40,$BE$35,IF(Y96=$BF$40,$BF$35,$BG$35))))))))","v":""},null,{"$f":"Réglages!$H$50","v":"Critères rappel >"},null,"C1 j",null,{"$f":"Réglages!$H$51","v":"Je me situe >"},null,null,null,{"$f":"IF(AK96=\"\",\"\",ISNUMBER(MATCH(AK96,IF(AT96=1,$AZ$35:$AZ$38,IF(AT96=2,$BA$35:$BA$38,IF(AT96=3,$BB$35:$BB$38,IF(AT96=4,$BC$35:$BC$38,IF(AT96=5,$BD$35:$BD$38,IF(AW$5=6,$BE$35:$BE$38,IF(AT96=7,$BF$35:$BF$38,IF(AT96=8,$BG$35:$BG$38,1)))))))),0)))","v":false},null,{"$f":"IF(Y96=\"\",\"\",INDEX($AZ$10:$BG$10,MATCH(Y96,$AZ$8:$BG$8,0)))","v":""},{"$f":"VALUE(RIGHT(AS96,1))","v":{"$error":"#VALUE!"}},null,"SI(AE35=AZ39;AZ35:AZ38;SI(AE35=BA39;BA35:BA38;SI(AE35=Bb39;Bb35:Bb38;SI(AE35=Bc39;Bc35:Bc38;SI(AE35=Bd39;Bd35:Bd38;SI(AE35=Be39;Be35:Be38;SI(AE35=Bf39;Bf35:Bf38;SI(AE35=Bg39;Bg35:Bg38;AY35:AY38))))))))",null,null,"c2",{"$f":"IF(Réglages!$B$15=\"\",\"\",\"C2 \"&Réglages!$B$15)","v":"C2 99 points"},{"$f":"IF(Réglages!$C$15=\"\",\"\",\"C2 \"&Réglages!$C$15)","v":""},{"$f":"IF(Réglages!$D$15=\"\",\"\",\"C2 \"&Réglages!$D$15)","v":""},{"$f":"IF(Réglages!$E$15=\"\",\"\",\"C2 \"&Réglages!$E$15)","v":""},{"$f":"IF(Réglages!$F$15=\"\",\"\",\"C2 \"&Réglages!$F$15)","v":""},{"$f":"IF(Réglages!$G$15=\"\",\"\",\"C2 \"&Réglages!$G$15)","v":""},{"$f":"IF(Réglages!$H$15=\"\",\"\",\"C2 \"&Réglages!$H$15)","v":""},{"$f":"IF(Réglages!$I$15=\"\",\"\",\"C2 \"&Réglages!$I$15)","v":""}]
[null,null,null,null,null,null,null,null,null,null,null,null,null,null,null,null,null,null,{"$f":" Réglages!$H$52&AR83&\" >\"","v":"Mon Projet pour L5 >"},null,null,null,null,null,null,null,null,null,null,null,null,null,null,null,null,null,null,null,{"$f":"Réglages!$H$53&AR83&\" >\"","v":"Mon Axe Pioritaire en L5 >"},null,"",null,null,null,null,null,null,null,null,null,"c3",{"$f":"IF(Réglages!$B$16=\"\",\"\",\"C3 \"&Réglages!$B$16)","v":"C3 999 pts "},{"$f":"IF(Réglages!$C$16=\"\",\"\",\"C3 \"&Réglages!$C$16)","v":""},{"$f":"IF(Réglages!$D$16=\"\",\"\",\"C3 \"&Réglages!$D$16)","v":""},{"$f":"IF(Réglages!$E$16=\"\",\"\",\"C3 \"&Réglages!$E$16)","v":""},{"$f":"IF(Réglages!$F$16=\"\",\"\",\"C3 \"&Réglages!$F$16)","v":""},{"$f":"IF(Réglages!$G$16=\"\",\"\",\"C3 \"&Réglages!$G$16)","v":""},{"$f":"IF(Réglages!$H$16=\"\",\"\",\"C3 \"&Réglages!$H$16)","v":""},{"$f":"IF(Réglages!$I$16=\"\",\"\",\"C3 \"&Réglages!$I$16)","v":""}]
[null,null,null,null,null,null,null,null,null,null,null,null,null,null,null,null,null,null,null,null,null,null,null,null,null,null,null,null,null,null,null,null,null,null,null,null,null,null,null,null,null,null,null,null,null,null,null,null,null,null,"c4",{"$f":"IF(Réglages!$B$17=\"\",\"\",\"C4 \"&Réglages!$B$17)","v":"C4 9999 pts"},{"$f":"IF(Réglages!$C$17=\"\",\"\",\"C4 \"&Réglages!$C$17)","v":""},{"$f":"IF(Réglages!$D$17=\"\",\"\",\"C4 \"&Réglages!$D$17)","v":""},{"$f":"IF(Réglages!$E$17=\"\",\"\",\"C4 \"&Réglages!$E$17)","v":""},{"$f":"IF(Réglages!$F$17=\"\",\"\",\"C4 \"&Réglages!$F$17)","v":""},{"$f":"IF(Réglages!$G$17=\"\",\"\",\"C4 \"&Réglages!$G$17)","v":""},{"$f":"IF(Réglages!$H$17=\"\",\"\",\"C4 \"&Réglages!$H$17)","v":""},{"$f":"IF(Réglages!$I$17=\"\",\"\",\"C4 \"&Réglages!$I$17)","v":""}]
[null,null,null,null,null,null,null,null,null,null,null,null,null,null,null,null,null,null,null,null,null,null,null,null,null,null,null,null,null,null,null,null,null,null,null,null,null,null,null,null,null,null,null,null,null,null,null,null,null,null,{"$f":"Réglages!$L$5","v":"Moteur "},{"$f":"IF($AZ$8=\"\",\"\",$AZ$8)","v":"Le serveur "},{"$f":"IF($BA$8=\"\",\"\",$BA$8)","v":"Observateur"},{"$f":"IF($BB$8=\"\",\"\",$BB$8)","v":"?"},{"$f":"IF($BC$8=\"\",\"\",$BC$8)","v":""},{"$f":"IF($BD$8=\"\",\"\",$BD$8)","v":""},{"$f":"IF($BE$8=\"\",\"\",$BE$8)","v":""},{"$f":"IF($BF$8=\"\",\"\",$BF$8)","v":""},{"$f":"IF($BG$8=\"\",\"\",$BG$8)","v":""}]
[null,null,null,null,null,null,null,null,null,null,null,null,null,null,null,null,null,null,null,null,null,null,null,null,null,null,null,null,null,null,null,null,null,null,null,null,null,null,null,null,null,null,null,null,null,null,null,null,null,null,{"$f":"Réglages!$L$6","v":"Non moteur"},{"$f":"IF($AZ$8=\"\",\"\",$AZ$8)","v":"Le serveur "},{"$f":"IF($BA$8=\"\",\"\",$BA$8)","v":"Observateur"},{"$f":"IF($BB$8=\"\",\"\",$BB$8)","v":"?"},{"$f":"IF($BC$8=\"\",\"\",$BC$8)","v":""},{"$f":"IF($BD$8=\"\",\"\",$BD$8)","v":""},{"$f":"IF($BE$8=\"\",\"\",$BE$8)","v":""},{"$f":"IF($BF$8=\"\",\"\",$BF$8)","v":""},{"$f":"IF($BG$8=\"\",\"\",$BG$8)","v":""}]
[]
[]
["Leçon 5",null,null,null,null,null,null,null,null,null,null,null,null,null,null,null,null,null,null,null,null,null,null,null,null,null,null,null,null,null,null,null,null,null,null,null,null,null,null,null,null,null,null,{"$f":"RIGHT(A103,1)+1","v":6},{"$f":"MATCH(AG105,IF(AW105=1,AZ92:AZ101,IF(AW105=2,BA92:BA101,1)),0)","v":{"$error":"#VALUE!"}},{"$f":"OR(AND(AW105=1,MATCH(AG105,AZ92:AZ101,0)),(AND(AW105=2,MATCH(AG105,BA92:BA101,0))))","v":{"$error":"#VALUE!"}}]
[null,null,null,null,null,null,null,null,null,null,null,null,null,null,null,null,null,null,{"$f":"Réglages!$D$54","v":"Axes de Travail "},null,null,null,null,null,null,null,null,null,null,null,null,null,{"$f":"Réglages!$F$50","v":"Situations d'apprentissage"},null,null,null,{"$f":"Réglages!$F$51","v":"Résultats "},null,{"$f":"Réglages!$F$52","v":"Je me projette"},null,null,null,null,-1,0,1,"réf",null,"n colonne","n ligne "]
[null,null,null,null,null,null,null,null,null,null,null,null,null,null,null,null,null,null,"",null,null,null,null,null,null,null,null,null,{"$f":"IF(S105=\"\",\"\",INDEX($AZ$10:$BG$10,MATCH(S105,$AZ$8:$BG$8,0)))","v":""},null,null,null,null,null,null,null,null,null,"3/ sit3",null,null,null,{"$f":"IF(AG105=\"\",\"\",ISNUMBER(MATCH(AG105,IF(AW105=1,$AZ$12:$AZ$26,IF(AW105=2,$BA$12:$BA$26,IF(AW105=3,$BB$12:$BB$26,IF(AW105=4,$BC$12:$BC$26,IF(AW105=5,$BD$12:$BD$26,IF(AW$5=6,$BE$12:$BE$26,IF(AW105=7,$BF$12:$BF$26,IF(AW105=8,$BG$12:$BG$26,1)))))))),0)))","v":""},{"$f":"IFERROR(INDEX($AZ$12:$BG$26,AX105-1,AW105),\"\")","v":""},{"$f":"IFERROR(INDEX($AZ$12:$BG$26,AX105,AW105),\"\")","v":""},{"$f":"IFERROR(INDEX($AZ$12:$BG$26,AX105+1,AW105),\"\")","v":""},"Sit de Réf",null,{"$f":"VALUE(RIGHT(AC105,1))","v":{"$error":"#VALUE!"}},{"$f":"VALUE(LEFT(AG105,2))","v":{"$error":"#VALUE!"}},{"$f":"IF(AM105=\"\",\"\",IF(AM105=AU105,AU105,ISNUMBER(MATCH(AM105,IF(AW105=1,$AZ$12:$AZ$26,IF(AW105=2,$BA$12:$BA$26,IF(AW105=3,$BB$12:$BB$26,IF(AW105=4,$BC$12:$BC$26,IF(AW105=5,$BD$12:$BD$26,IF(AW$5=6,$BE$12:$BE$26,IF(AW105=7,$BF$12:$BF$26,IF(AW105=8,$BG$12:$BG$26,1)))))))),0))))","v":false}]
[null,null,null,null,null,null,null,null,null,null,null,null,null,null,null,null,null,null,"",null,null,null,null,null,null,null,null,null,"",null,null,null,null,null,null,null,null,null,null,null,null,null,{"$f":"IF(AG106=\"\",\"\",ISNUMBER(MATCH(AG106,IF(AW106=1,$AZ$12:$AZ$26,IF(AW106=2,$BA$12:$BA$26,IF(AW106=3,$BB$12:$BB$26,IF(AW106=4,$BC$12:$BC$26,IF(AW106=5,$BD$12:$BD$26,IF(AW$5=6,$BE$12:$BE$26,IF(AW106=7,$BF$12:$BF$26,IF(AW106=8,$BG$12:$BG$26,1)))))))),0)))","v":""},{"$f":"IFERROR(INDEX($AZ$12:$BG$26,AX106-1,AW106),\"\")","v":""},{"$f":"IFERROR(INDEX($AZ$12:$BG$26,AX106,AW106),\"\")","v":""},{"$f":"IFERROR(INDEX($AZ$12:$BG$26,AX106+1,AW106),\"\")","v":""},"Sit de Réf",null,{"$error":"#VALUE!"},{"$f":"VALUE(LEFT(AG106,2))","v":{"$error":"#VALUE!"}},{"$f":"IF(AM106=\"\",\"\",IF(AM106=AU106,AU106,ISNUMBER(MATCH(AM106,IF(AW106=1,$AZ$12:$AZ$26,IF(AW106=2,$BA$12:$BA$26,IF(AW106=3,$BB$12:$BB$26,IF(AW106=4,$BC$12:$BC$26,IF(AW106=5,$BD$12:$BD$26,IF(AW$5=6,$BE$12:$BE$26,IF(AW106=7,$BF$12:$BF$26,IF(AW106=8,$BG$12:$BG$26,1)))))))),0))))","v":""}]
[null,null,null,null,null,null,null,null,null,null,null,null,null,null,null,null,null,null,"",null,null,null,null,null,null,null,null,null,"",null,null,null,null,null,null,null,null,null,null,null,null,null,"","","","","Sit de Réf",null,{"$error":"#VALUE!"},{"$error":"#VALUE!"},""]
[null,null,null,null,null,null,null,null,null,null,null,null,null,null,null,null,null,null,"",null,null,null,null,null,null,null,null,null,"",null,null,null,null,null,null,null,null,null,null,null,null,null,"","","","","Sit de Réf",null,{"$error":"#VALUE!"},{"$error":"#VALUE!"},""]
[null,null,null,null,null,null,null,null,null,null,null,null,null,null,null,null,null,null,"",null,null,null,null,null,null,null,null,null,"",null,null,null,null,null,null,null,null,null,null,null,null,null,"","","","","Sit de Réf",null,{"$error":"#VALUE!"},{"$error":"#VALUE!"},""]
[null,null,null,null,null,null,null,null,null,null,null,null,null,null,null,null,null,null,"",null,null,null,null,null,null,null,null,null,"",null,null,null,null,null,null,null,null,null,null,null,null,null,"","","","","Sit de Réf",null,{"$error":"#VALUE!"},{"$error":"#VALUE!"},""]
[null,null,null,null,null,null,null,null,null,null,null,null,null,null,null,null,null,null,"",null,null,null,null,null,null,null,null,null,"",null,null,null,null,null,null,null,null,null,null,null,null,null,"","","","","Sit de Réf",null,{"$error":"#VALUE!"},{"$error":"#VALUE!"},""]
[null,null,null,null,null,null,null,null,null,null,null,null,null,null,null,null,null,null,"",null,null,null,null,null,null,null,null,null,"",null,null,null,null,null,null,null,null,null,null,null,null,null,"","","","","Sit de Réf",null,{"$error":"#VALUE!"},{"$error":"#VALUE!"},""]
[null,null,null,null,null,null,null,null,null,null,null,null,null,null,null,null,null,null,"",null,null,null,null,null,null,null,null,null,"",null,null,null,null,null,null,null,null,null,null,null,null,null,"","","","","Sit de Réf",null,{"$error":"#VALUE!"},{"$error":"#VALUE!"},"",{"$f":"$AZ$9","v":"Moteur "},{"$f":"$BA$9","v":"Non moteur"},{"$f":"$BB$9","v":"Quel enjeu ?"},{"$f":"$BC$9","v":""},{"$f":"$BD$9","v":""},{"$f":"$BE$9","v":""},{"$f":"$BF$9","v":""},{"$f":"$BG$9","v":""}]
[null,null,null,null,null,null,null,null,null,null,null,null,null,null,null,null,null,null,"",null,null,null,null,null,null,null,null,null,"",null,null,null,null,null,null,null,null,null,null,null,null,null,"","","","","Sit de Réf",null,{"$error":"#VALUE!"},{"$error":"#VALUE!"},"",{"$f":"IF(Réglages!$B$12=\"\",\"\",\"Sit de Réf :  \"&Réglages!$B$12)","v":"Sit de Réf :  Le sablier"},{"$f":"IF(Réglages!$C$12=\"\",\"\",\"Sit de Réf :  \"&Réglages!$C$12)","v":""},{"$f":"IF(Réglages!$D$12=\"\",\"\",\"Sit de Réf :  \"&Réglages!$D$12)","v":""},{"$f":"IF(Réglages!$E$12=\"\",\"\",\"Sit de Réf :  \"&Réglages!$E$12)","v":""},{"$f":"IF(Réglages!$F$12=\"\",\"\",\"Sit de Réf :  \"&Réglages!$F$12)","v":""},{"$f":"IF(Réglages!$G$12=\"\",\"\",\"Sit de Réf :  \"&Réglages!$G$12)","v":""},{"$f":"IF(Réglages!$H$12=\"\",\"\",\"Sit de Réf :  \"&Réglages!$H$12)","v":""},{"$f":"IF(Réglages!$I$12=\"\",\"\",\"Sit de Réf :  \"&Réglages!$I$12)","v":""}]
[null,null,null,null,null,null,null,null,null,null,null,null,null,null,null,null,null,null,{"$f":"Réglages!$F$53","v":"Enjeu de travail principal de cette leçon >"},null,null,null,null,null,"",null,null,null,null,null,null,null,{"$f":"IF(Y115=\"\",\"\",IF(Y115=$AZ$39,$AZ$34,IF(Y115=$BA$39,$BA$34,IF(Y115=$BB$39,$BB$34,IF(Y115=$BC$39,$BC$34,IF(Y115=$BD$39,$BD$34,IF(Y115=$BE$39,$BE$34,IF(Y115=$BF$39,$BF$34,$BG$34))))))))","v":""},null,{"$f":"Réglages!$H$50","v":"Critères rappel >"},null,"C2 fggzev",null,{"$f":"Réglages!$H$51","v":"Je me situe >"},null,null,null,{"$f":"IF(AK115=\"\",\"\",ISNUMBER(MATCH(AK115,IF(AT115=1,$AZ$35:$AZ$38,IF(AT115=2,$BA$35:$BA$38,IF(AT115=3,$BB$35:$BB$38,IF(AT115=4,$BC$35:$BC$38,IF(AT115=5,$BD$35:$BD$38,IF(AW$5=6,$BE$35:$BE$38,IF(AT115=7,$BF$35:$BF$38,IF(AT115=8,$BG$35:$BG$38,1)))))))),0)))","v":false},"droite axe !!!!",{"$f":"IF(Y115=\"\",\"\",INDEX($AZ$10:$BG$10,MATCH(Y115,$AZ$8:$BG$8,0)))","v":""},{"$f":"VALUE(RIGHT(AS115,1))","v":{"$error":"#VALUE!"}},null,null,null,null,"c1",{"$f":"IF(Réglages!$B$14=\"\",\"\",\"C1 \"&Réglages!$B$14)","v":"C1 9 points"},{"$f":"IF(Réglages!$C$14=\"\",\"\",\"C1 \"&Réglages!$C$14)","v":""},{"$f":"IF(Réglages!$D$14=\"\",\"\",\"C1 \"&Réglages!$D$14)","v":""},{"$f":"IF(Réglages!$E$14=\"\",\"\",\"C1 \"&Réglages!$E$14)","v":""},{"$f":"IF(Réglages!$F$14=\"\",\"\",\"C1 \"&Réglages!$F$14)","v":""},{"$f":"IF(Réglages!$G$14=\"\",\"\",\"C1 \"&Réglages!$G$14)","v":""},{"$f":"IF(Réglages!$H$14=\"\",\"\",\"C1 \"&Réglages!$H$14)","v":""},{"$f":"IF(Réglages!$I$14=\"\",\"\",\"C1 \"&Réglages!$I$14)","v":""}]
[null,null,null,null,null,null,null,null,null,null,null,null,null,null,null,null,null,null,{"$f":"Réglages!$F$54","v":"Enjeu de travail secondaire de cette leçon >"},null,null,null,null,null,"",null,null,null,null,null,null,null,{"$f":"IF(Y116=\"\",\"\",IF(Y116=$AZ$40,$AZ$35,IF(Y116=$BA$40,$BA$35,IF(Y116=$BB$40,$BB$35,IF(Y116=$BC$40,$BC$35,IF(Y116=$BD$40,$BD$35,IF(Y116=$BE$40,$BE$35,IF(Y116=$BF$40,$BF$35,$BG$35))))))))","v":""},null,{"$f":"Réglages!$H$50","v":"Critères rappel >"},null,"C1 j",null,{"$f":"Réglages!$H$51","v":"Je me situe >"},null,null,null,{"$f":"IF(AK116=\"\",\"\",ISNUMBER(MATCH(AK116,IF(AT116=1,$AZ$35:$AZ$38,IF(AT116=2,$BA$35:$BA$38,IF(AT116=3,$BB$35:$BB$38,IF(AT116=4,$BC$35:$BC$38,IF(AT116=5,$BD$35:$BD$38,IF(AW$5=6,$BE$35:$BE$38,IF(AT116=7,$BF$35:$BF$38,IF(AT116=8,$BG$35:$BG$38,1)))))))),0)))","v":false},null,{"$f":"IF(Y116=\"\",\"\",INDEX($AZ$10:$BG$10,MATCH(Y116,$AZ$8:$BG$8,0)))","v":""},{"$f":"VALUE(RIGHT(AS116,1))","v":{"$error":"#VALUE!"}},null,"SI(AE35=AZ39;AZ35:AZ38;SI(AE35=BA39;BA35:BA38;SI(AE35=Bb39;Bb35:Bb38;SI(AE35=Bc39;Bc35:Bc38;SI(AE35=Bd39;Bd35:Bd38;SI(AE35=Be39;Be35:Be38;SI(AE35=Bf39;Bf35:Bf38;SI(AE35=Bg39;Bg35:Bg38;AY35:AY38))))))))",null,null,"c2",{"$f":"IF(Réglages!$B$15=\"\",\"\",\"C2 \"&Réglages!$B$15)","v":"C2 99 points"},{"$f":"IF(Réglages!$C$15=\"\",\"\",\"C2 \"&Réglages!$C$15)","v":""},{"$f":"IF(Réglages!$D$15=\"\",\"\",\"C2 \"&Réglages!$D$15)","v":""},{"$f":"IF(Réglages!$E$15=\"\",\"\",\"C2 \"&Réglages!$E$15)","v":""},{"$f":"IF(Réglages!$F$15=\"\",\"\",\"C2 \"&Réglages!$F$15)","v":""},{"$f":"IF(Réglages!$G$15=\"\",\"\",\"C2 \"&Réglages!$G$15)","v":""},{"$f":"IF(Réglages!$H$15=\"\",\"\",\"C2 \"&Réglages!$H$15)","v":""},{"$f":"IF(Réglages!$I$15=\"\",\"\",\"C2 \"&Réglages!$I$15)","v":""}]
[null,null,null,null,null,null,null,null,null,null,null,null,null,null,null,null,null,null,{"$f":" Réglages!$H$52&AR103&\" >\"","v":"Mon Projet pour L6 >"},null,null,null,null,null,null,null,null,null,null,null,null,null,null,null,null,null,null,null,{"$f":"Réglages!$H$53&AR103&\" >\"","v":"Mon Axe Pioritaire en L6 >"},null,"",null,null,null,null,null,null,null,null,null,"c3",{"$f":"IF(Réglages!$B$16=\"\",\"\",\"C3 \"&Réglages!$B$16)","v":"C3 999 pts "},{"$f":"IF(Réglages!$C$16=\"\",\"\",\"C3 \"&Réglages!$C$16)","v":""},{"$f":"IF(Réglages!$D$16=\"\",\"\",\"C3 \"&Réglages!$D$16)","v":""},{"$f":"IF(Réglages!$E$16=\"\",\"\",\"C3 \"&Réglages!$E$16)","v":""},{"$f":"IF(Réglages!$F$16=\"\",\"\",\"C3 \"&Réglages!$F$16)","v":""},{"$f":"IF(Réglages!$G$16=\"\",\"\",\"C3 \"&Réglages!$G$16)","v":""},{"$f":"IF(Réglages!$H$16=\"\",\"\",\"C3 \"&Réglages!$H$16)","v":""},{"$f":"IF(Réglages!$I$16=\"\",\"\",\"C3 \"&Réglages!$I$16)","v":""}]
[null,null,null,null,null,null,null,null,null,null,null,null,null,null,null,null,null,null,null,null,null,null,null,null,null,null,null,null,null,null,null,null,null,null,null,null,null,null,null,null,null,null,null,null,null,null,null,null,null,null,"c4",{"$f":"IF(Réglages!$B$17=\"\",\"\",\"C4 \"&Réglages!$B$17)","v":"C4 9999 pts"},{"$f":"IF(Réglages!$C$17=\"\",\"\",\"C4 \"&Réglages!$C$17)","v":""},{"$f":"IF(Réglages!$D$17=\"\",\"\",\"C4 \"&Réglages!$D$17)","v":""},{"$f":"IF(Réglages!$E$17=\"\",\"\",\"C4 \"&Réglages!$E$17)","v":""},{"$f":"IF(Réglages!$F$17=\"\",\"\",\"C4 \"&Réglages!$F$17)","v":""},{"$f":"IF(Réglages!$G$17=\"\",\"\",\"C4 \"&Réglages!$G$17)","v":""},{"$f":"IF(Réglages!$H$17=\"\",\"\",\"C4 \"&Réglages!$H$17)","v":""},{"$f":"IF(Réglages!$I$17=\"\",\"\",\"C4 \"&Réglages!$I$17)","v":""}]
[null,null,null,null,null,null,null,null,null,null,null,null,null,null,null,null,null,null,null,null,null,null,null,null,null,null,null,null,null,null,null,null,null,null,null,null,null,null,null,null,null,null,null,null,null,null,null,null,null,null,{"$f":"Réglages!$L$5","v":"Moteur "},{"$f":"IF($AZ$8=\"\",\"\",$AZ$8)","v":"Le serveur "},{"$f":"IF($BA$8=\"\",\"\",$BA$8)","v":"Observateur"},{"$f":"IF($BB$8=\"\",\"\",$BB$8)","v":"?"},{"$f":"IF($BC$8=\"\",\"\",$BC$8)","v":""},{"$f":"IF($BD$8=\"\",\"\",$BD$8)","v":""},{"$f":"IF($BE$8=\"\",\"\",$BE$8)","v":""},{"$f":"IF($BF$8=\"\",\"\",$BF$8)","v":""},{"$f":"IF($BG$8=\"\",\"\",$BG$8)","v":""}]
[null,null,null,null,null,null,null,null,null,null,null,null,null,null,null,null,null,null,null,null,null,null,null,null,null,null,null,null,null,null,null,null,null,null,null,null,null,null,null,null,null,null,null,null,null,null,null,null,null,null,{"$f":"Réglages!$L$6","v":"Non moteur"},{"$f":"IF($AZ$8=\"\",\"\",$AZ$8)","v":"Le serveur "},{"$f":"IF($BA$8=\"\",\"\",$BA$8)","v":"Observateur"},{"$f":"IF($BB$8=\"\",\"\",$BB$8)","v":"?"},{"$f":"IF($BC$8=\"\",\"\",$BC$8)","v":""},{"$f":"IF($BD$8=\"\",\"\",$BD$8)","v":""},{"$f":"IF($BE$8=\"\",\"\",$BE$8)","v":""},{"$f":"IF($BF$8=\"\",\"\",$BF$8)","v":""},{"$f":"IF($BG$8=\"\",\"\",$BG$8)","v":""}]
[]
[]
[null,null,null,null,null,null,null,null,null,null,null,null,null,null,null,null,null,"Leçon 6",null,null,null,null,null,null,null,null,null,null,null,null,null,null,null,null,null,null,null,null,null,null,null,null,null,{"$f":"RIGHT(R123,1)+1","v":7},{"$f":"MATCH(AG125,IF(AW125=1,AZ112:AZ121,IF(AW125=2,BA112:BA121,1)),0)","v":{"$error":"#VALUE!"}},{"$f":"OR(AND(AW125=1,MATCH(AG125,AZ112:AZ121,0)),(AND(AW125=2,MATCH(AG125,BA112:BA121,0))))","v":{"$error":"#VALUE!"}}]
[null,null,null,null,null,null,null,null,null,null,null,null,null,null,null,null,null,null,{"$f":"Réglages!$D$54","v":"Axes de Travail "},null,null,null,null,null,null,null,null,null,null,null,null,null,{"$f":"Réglages!$F$50","v":"Situations d'apprentissage"},null,null,null,{"$f":"Réglages!$F$51","v":"Résultats "},null,{"$f":"Réglages!$F$52","v":"Je me projette"},null,null,null,null,-1,0,1,"réf",null,"n colonne","n ligne "]
[null,null,null,null,null,null,null,null,null,null,null,null,null,null,null,null,null,null,"",null,null,null,null,null,null,null,null,null,{"$f":"IF(S125=\"\",\"\",INDEX($AZ$10:$BG$10,MATCH(S125,$AZ$8:$BG$8,0)))","v":""},null,null,null,null,null,null,null,null,null,"3/ sit3",null,null,null,{"$f":"IF(AG125=\"\",\"\",ISNUMBER(MATCH(AG125,IF(AW125=1,$AZ$12:$AZ$26,IF(AW125=2,$BA$12:$BA$26,IF(AW125=3,$BB$12:$BB$26,IF(AW125=4,$BC$12:$BC$26,IF(AW125=5,$BD$12:$BD$26,IF(AW$5=6,$BE$12:$BE$26,IF(AW125=7,$BF$12:$BF$26,IF(AW125=8,$BG$12:$BG$26,1)))))))),0)))","v":""},{"$f":"IFERROR(INDEX($AZ$12:$BG$26,AX125-1,AW125),\"\")","v":""},{"$f":"IFERROR(INDEX($AZ$12:$BG$26,AX125,AW125),\"\")","v":""},{"$f":"IFERROR(INDEX($AZ$12:$BG$26,AX125+1,AW125),\"\")","v":""},"Sit de Réf",null,{"$f":"VALUE(RIGHT(AC125,1))","v":{"$error":"#VALUE!"}},{"$f":"VALUE(LEFT(AG125,2))","v":{"$error":"#VALUE!"}},{"$f":"IF(AM125=\"\",\"\",IF(AM125=AU125,AU125,ISNUMBER(MATCH(AM125,IF(AW125=1,$AZ$12:$AZ$26,IF(AW125=2,$BA$12:$BA$26,IF(AW125=3,$BB$12:$BB$26,IF(AW125=4,$BC$12:$BC$26,IF(AW125=5,$BD$12:$BD$26,IF(AW$5=6,$BE$12:$BE$26,IF(AW125=7,$BF$12:$BF$26,IF(AW125=8,$BG$12:$BG$26,1)))))))),0))))","v":false}]
[null,null,null,null,null,null,null,null,null,null,null,null,null,null,null,null,null,null,"",null,null,null,null,null,null,null,null,null,"",null,null,null,null,null,null,null,null,null,null,null,null,null,{"$f":"IF(AG126=\"\",\"\",ISNUMBER(MATCH(AG126,IF(AW126=1,$AZ$12:$AZ$26,IF(AW126=2,$BA$12:$BA$26,IF(AW126=3,$BB$12:$BB$26,IF(AW126=4,$BC$12:$BC$26,IF(AW126=5,$BD$12:$BD$26,IF(AW$5=6,$BE$12:$BE$26,IF(AW126=7,$BF$12:$BF$26,IF(AW126=8,$BG$12:$BG$26,1)))))))),0)))","v":""},{"$f":"IFERROR(INDEX($AZ$12:$BG$26,AX126-1,AW126),\"\")","v":""},{"$f":"IFERROR(INDEX($AZ$12:$BG$26,AX126,AW126),\"\")","v":""},{"$f":"IFERROR(INDEX($AZ$12:$BG$26,AX126+1,AW126),\"\")","v":""},"Sit de Réf",null,{"$error":"#VALUE!"},{"$f":"VALUE(LEFT(AG126,2))","v":{"$error":"#VALUE!"}},{"$f":"IF(AM126=\"\",\"\",IF(AM126=AU126,AU126,ISNUMBER(MATCH(AM126,IF(AW126=1,$AZ$12:$AZ$26,IF(AW126=2,$BA$12:$BA$26,IF(AW126=3,$BB$12:$BB$26,IF(AW126=4,$BC$12:$BC$26,IF(AW126=5,$BD$12:$BD$26,IF(AW$5=6,$BE$12:$BE$26,IF(AW126=7,$BF$12:$BF$26,IF(AW126=8,$BG$12:$BG$26,1)))))))),0))))","v":""}]
[null,null,null,null,null,null,null,null,null,null,null,null,null,null,null,null,null,null,"",null,null,null,null,null,null,null,null,null,"",null,null,null,null,null,null,null,null,null,null,null,null,null,"","","","","Sit de Réf",null,{"$error":"#VALUE!"},{"$error":"#VALUE!"},""]
[null,null,null,null,null,null,null,null,null,null,null,null,null,null,null,null,null,null,"",null,null,null,null,null,null,null,null,null,"",null,null,null,null,null,null,null,null,null,null,null,null,null,"","","","","Sit de Réf",null,{"$error":"#VALUE!"},{"$error":"#VALUE!"},""]
[null,null,null,null,null,null,null,null,null,null,null,null,null,null,null,null,null,null,"",null,null,null,null,null,null,null,null,null,"",null,null,null,null,null,null,null,null,null,null,null,null,null,"","","","","Sit de Réf",null,{"$error":"#VALUE!"},{"$error":"#VALUE!"},""]
[null,null,null,null,null,null,null,null,null,null,null,null,null,null,null,null,null,null,"",null,null,null,null,null,null,null,null,null,"",null,null,null,null,null,null,null,null,null,null,null,null,null,"","","","","Sit de Réf",null,{"$error":"#VALUE!"},{"$error":"#VALUE!"},""]
[null,null,null,null,null,null,null,null,null,null,null,null,null,null,null,null,null,null,"",null,null,null,null,null,null,null,null,null,"",null,null,null,null,null,null,null,null,null,null,null,null,null,"","","","","Sit de Réf",null,{"$error":"#VALUE!"},{"$error":"#VALUE!"},""]
[null,null,null,null,null,null,null,null,null,null,null,null,null,null,null,null,null,null,"",null,null,null,null,null,null,null,null,null,"",null,null,null,null,null,null,null,null,null,null,null,null,null,"","","","","Sit de Réf",null,{"$error":"#VALUE!"},{"$error":"#VALUE!"},""]
[null,null,null,null,null,null,null,null,null,null,null,null,null,null,null,null,null,null,"",null,null,null,null,null,null,null,null,null,"",null,null,null,null,null,null,null,null,null,null,null,null,null,"","","","","Sit de Réf",null,{"$error":"#VALUE!"},{"$error":"#VALUE!"},"",{"$f":"$AZ$9","v":"Moteur "},{"$f":"$BA$9","v":"Non moteur"},{"$f":"$BB$9","v":"Quel enjeu ?"},{"$f":"$BC$9","v":""},{"$f":"$BD$9","v":""},{"$f":"$BE$9","v":""},{"$f":"$BF$9","v":""},{"$f":"$BG$9","v":""}]
[null,null,null,null,null,null,null,null,null,null,null,null,null,null,null,null,null,null,"",null,null,null,null,null,null,null,null,null,"",null,null,null,null,null,null,null,null,null,null,null,null,null,"","","","","Sit de Réf",null,{"$error":"#VALUE!"},{"$error":"#VALUE!"},"",{"$f":"IF(Réglages!$B$12=\"\",\"\",\"Sit de Réf :  \"&Réglages!$B$12)","v":"Sit de Réf :  Le sablier"},{"$f":"IF(Réglages!$C$12=\"\",\"\",\"Sit de Réf :  \"&Réglages!$C$12)","v":""},{"$f":"IF(Réglages!$D$12=\"\",\"\",\"Sit de Réf :  \"&Réglages!$D$12)","v":""},{"$f":"IF(Réglages!$E$12=\"\",\"\",\"Sit de Réf :  \"&Réglages!$E$12)","v":""},{"$f":"IF(Réglages!$F$12=\"\",\"\",\"Sit de Réf :  \"&Réglages!$F$12)","v":""},{"$f":"IF(Réglages!$G$12=\"\",\"\",\"Sit de Réf :  \"&Réglages!$G$12)","v":""},{"$f":"IF(Réglages!$H$12=\"\",\"\",\"Sit de Réf :  \"&Réglages!$H$12)","v":""},{"$f":"IF(Réglages!$I$12=\"\",\"\",\"Sit de Réf :  \"&Réglages!$I$12)","v":""}]
[null,null,null,null,null,null,null,null,null,null,null,null,null,null,null,null,null,null,{"$f":"Réglages!$F$53","v":"Enjeu de travail principal de cette leçon >"},null,null,null,null,null,"",null,null,null,null,null,null,null,{"$f":"IF(Y135=\"\",\"\",IF(Y135=$AZ$39,$AZ$34,IF(Y135=$BA$39,$BA$34,IF(Y135=$BB$39,$BB$34,IF(Y135=$BC$39,$BC$34,IF(Y135=$BD$39,$BD$34,IF(Y135=$BE$39,$BE$34,IF(Y135=$BF$39,$BF$34,$BG$34))))))))","v":""},null,{"$f":"Réglages!$H$50","v":"Critères rappel >"},null,"C2 fggzev",null,{"$f":"Réglages!$H$51","v":"Je me situe >"},null,null,null,{"$f":"IF(AK135=\"\",\"\",ISNUMBER(MATCH(AK135,IF(AT135=1,$AZ$35:$AZ$38,IF(AT135=2,$BA$35:$BA$38,IF(AT135=3,$BB$35:$BB$38,IF(AT135=4,$BC$35:$BC$38,IF(AT135=5,$BD$35:$BD$38,IF(AW$5=6,$BE$35:$BE$38,IF(AT135=7,$BF$35:$BF$38,IF(AT135=8,$BG$35:$BG$38,1)))))))),0)))","v":false},"droite axe !!!!",{"$f":"IF(Y135=\"\",\"\",INDEX($AZ$10:$BG$10,MATCH(Y135,$AZ$8:$BG$8,0)))","v":""},{"$f":"VALUE(RIGHT(AS135,1))","v":{"$error":"#VALUE!"}},null,null,null,null,"c1",{"$f":"IF(Réglages!$B$14=\"\",\"\",\"C1 \"&Réglages!$B$14)","v":"C1 9 points"},{"$f":"IF(Réglages!$C$14=\"\",\"\",\"C1 \"&Réglages!$C$14)","v":""},{"$f":"IF(Réglages!$D$14=\"\",\"\",\"C1 \"&Réglages!$D$14)","v":""},{"$f":"IF(Réglages!$E$14=\"\",\"\",\"C1 \"&Réglages!$E$14)","v":""},{"$f":"IF(Réglages!$F$14=\"\",\"\",\"C1 \"&Réglages!$F$14)","v":""},{"$f":"IF(Réglages!$G$14=\"\",\"\",\"C1 \"&Réglages!$G$14)","v":""},{"$f":"IF(Réglages!$H$14=\"\",\"\",\"C1 \"&Réglages!$H$14)","v":""},{"$f":"IF(Réglages!$I$14=\"\",\"\",\"C1 \"&Réglages!$I$14)","v":""}]
[null,null,null,null,null,null,null,null,null,null,null,null,null,null,null,null,null,null,{"$f":"Réglages!$F$54","v":"Enjeu de travail secondaire de cette leçon >"},null,null,null,null,null,"",null,null,null,null,null,null,null,{"$f":"IF(Y136=\"\",\"\",IF(Y136=$AZ$40,$AZ$35,IF(Y136=$BA$40,$BA$35,IF(Y136=$BB$40,$BB$35,IF(Y136=$BC$40,$BC$35,IF(Y136=$BD$40,$BD$35,IF(Y136=$BE$40,$BE$35,IF(Y136=$BF$40,$BF$35,$BG$35))))))))","v":""},null,{"$f":"Réglages!$H$50","v":"Critères rappel >"},null,"C1 j",null,{"$f":"Réglages!$H$51","v":"Je me situe >"},null,null,null,{"$f":"IF(AK136=\"\",\"\",ISNUMBER(MATCH(AK136,IF(AT136=1,$AZ$35:$AZ$38,IF(AT136=2,$BA$35:$BA$38,IF(AT136=3,$BB$35:$BB$38,IF(AT136=4,$BC$35:$BC$38,IF(AT136=5,$BD$35:$BD$38,IF(AW$5=6,$BE$35:$BE$38,IF(AT136=7,$BF$35:$BF$38,IF(AT136=8,$BG$35:$BG$38,1)))))))),0)))","v":false},null,{"$f":"IF(Y136=\"\",\"\",INDEX($AZ$10:$BG$10,MATCH(Y136,$AZ$8:$BG$8,0)))","v":""},{"$f":"VALUE(RIGHT(AS136,1))","v":{"$error":"#VALUE!"}},null,"SI(AE35=AZ39;AZ35:AZ38;SI(AE35=BA39;BA35:BA38;SI(AE35=Bb39;Bb35:Bb38;SI(AE35=Bc39;Bc35:Bc38;SI(AE35=Bd39;Bd35:Bd38;SI(AE35=Be39;Be35:Be38;SI(AE35=Bf39;Bf35:Bf38;SI(AE35=Bg39;Bg35:Bg38;AY35:AY38))))))))",null,null,"c2",{"$f":"IF(Réglages!$B$15=\"\",\"\",\"C2 \"&Réglages!$B$15)","v":"C2 99 points"},{"$f":"IF(Réglages!$C$15=\"\",\"\",\"C2 \"&Réglages!$C$15)","v":""},{"$f":"IF(Réglages!$D$15=\"\",\"\",\"C2 \"&Réglages!$D$15)","v":""},{"$f":"IF(Réglages!$E$15=\"\",\"\",\"C2 \"&Réglages!$E$15)","v":""},{"$f":"IF(Réglages!$F$15=\"\",\"\",\"C2 \"&Réglages!$F$15)","v":""},{"$f":"IF(Réglages!$G$15=\"\",\"\",\"C2 \"&Réglages!$G$15)","v":""},{"$f":"IF(Réglages!$H$15=\"\",\"\",\"C2 \"&Réglages!$H$15)","v":""},{"$f":"IF(Réglages!$I$15=\"\",\"\",\"C2 \"&Réglages!$I$15)","v":""}]
[null,null,null,null,null,null,null,null,null,null,null,null,null,null,null,null,null,null,{"$f":" Réglages!$H$52&AR123&\" >\"","v":"Mon Projet pour L7 >"},null,null,null,null,null,null,null,null,null,null,null,null,null,null,null,null,null,null,null,{"$f":"Réglages!$H$53&AR123&\" >\"","v":"Mon Axe Pioritaire en L7 >"},null,"",null,null,null,null,null,null,null,null,null,"c3",{"$f":"IF(Réglages!$B$16=\"\",\"\",\"C3 \"&Réglages!$B$16)","v":"C3 999 pts "},{"$f":"IF(Réglages!$C$16=\"\",\"\",\"C3 \"&Réglages!$C$16)","v":""},{"$f":"IF(Réglages!$D$16=\"\",\"\",\"C3 \"&Réglages!$D$16)","v":""},{"$f":"IF(Réglages!$E$16=\"\",\"\",\"C3 \"&Réglages!$E$16)","v":""},{"$f":"IF(Réglages!$F$16=\"\",\"\",\"C3 \"&Réglages!$F$16)","v":""},{"$f":"IF(Réglages!$G$16=\"\",\"\",\"C3 \"&Réglages!$G$16)","v":""},{"$f":"IF(Réglages!$H$16=\"\",\"\",\"C3 \"&Réglages!$H$16)","v":""},{"$f":"IF(Réglages!$I$16=\"\",\"\",\"C3 \"&Réglages!$I$16)","v":""}]
[null,null,null,null,null,null,null,null,null,null,null,null,null,null,null,null,null,null,null,null,null,null,null,null,null,null,null,null,null,null,null,null,null,null,null,null,null,null,null,null,null,null,null,null,null,null,null,null,null,null,"c4",{"$f":"IF(Réglages!$B$17=\"\",\"\",\"C4 \"&Réglages!$B$17)","v":"C4 9999 pts"},{"$f":"IF(Réglages!$C$17=\"\",\"\",\"C4 \"&Réglages!$C$17)","v":""},{"$f":"IF(Réglages!$D$17=\"\",\"\",\"C4 \"&Réglages!$D$17)","v":""},{"$f":"IF(Réglages!$E$17=\"\",\"\",\"C4 \"&Réglages!$E$17)","v":""},{"$f":"IF(Réglages!$F$17=\"\",\"\",\"C4 \"&Réglages!$F$17)","v":""},{"$f":"IF(Réglages!$G$17=\"\",\"\",\"C4 \"&Réglages!$G$17)","v":""},{"$f":"IF(Réglages!$H$17=\"\",\"\",\"C4 \"&Réglages!$H$17)","v":""},{"$f":"IF(Réglages!$I$17=\"\",\"\",\"C4 \"&Réglages!$I$17)","v":""}]
[null,null,null,null,null,null,null,null,null,null,null,null,null,null,null,null,null,null,null,null,null,null,null,null,null,null,null,null,null,null,null,null,null,null,null,null,null,null,null,null,null,null,null,null,null,null,null,null,null,null,{"$f":"Réglages!$L$5","v":"Moteur "},{"$f":"IF($AZ$8=\"\",\"\",$AZ$8)","v":"Le serveur "},{"$f":"IF($BA$8=\"\",\"\",$BA$8)","v":"Observateur"},{"$f":"IF($BB$8=\"\",\"\",$BB$8)","v":"?"},{"$f":"IF($BC$8=\"\",\"\",$BC$8)","v":""},{"$f":"IF($BD$8=\"\",\"\",$BD$8)","v":""},{"$f":"IF($BE$8=\"\",\"\",$BE$8)","v":""},{"$f":"IF($BF$8=\"\",\"\",$BF$8)","v":""},{"$f":"IF($BG$8=\"\",\"\",$BG$8)","v":""}]
[null,null,null,null,null,null,null,null,null,null,null,null,null,null,null,null,null,null,null,null,null,null,null,null,null,null,null,null,null,null,null,null,null,null,null,null,null,null,null,null,null,null,null,null,null,null,null,null,null,null,{"$f":"Réglages!$L$6","v":"Non moteur"},{"$f":"IF($AZ$8=\"\",\"\",$AZ$8)","v":"Le serveur "},{"$f":"IF($BA$8=\"\",\"\",$BA$8)","v":"Observateur"},{"$f":"IF($BB$8=\"\",\"\",$BB$8)","v":"?"},{"$f":"IF($BC$8=\"\",\"\",$BC$8)","v":""},{"$f":"IF($BD$8=\"\",\"\",$BD$8)","v":""},{"$f":"IF($BE$8=\"\",\"\",$BE$8)","v":""},{"$f":"IF($BF$8=\"\",\"\",$BF$8)","v":""},{"$f":"IF($BG$8=\"\",\"\",$BG$8)","v":""}]
[]
[]
[null,null,null,null,null,null,null,null,null,null,null,null,null,null,null,null,null,"Leçon 7",null,null,null,null,null,null,null,null,null,null,null,null,null,null,null,null,null,null,null,null,null,null,null,null,null,{"$f":"RIGHT(R143,1)+1","v":8},{"$f":"MATCH(AG145,IF(AW145=1,AZ132:AZ141,IF(AW145=2,BA132:BA141,1)),0)","v":{"$error":"#VALUE!"}},{"$f":"OR(AND(AW145=1,MATCH(AG145,AZ132:AZ141,0)),(AND(AW145=2,MATCH(AG145,BA132:BA141,0))))","v":{"$error":"#VALUE!"}}]
[null,null,null,null,null,null,null,null,null,null,null,null,null,null,null,null,null,null,{"$f":"Réglages!$D$54","v":"Axes de Travail "},null,null,null,null,null,null,null,null,null,null,null,null,null,{"$f":"Réglages!$F$50","v":"Situations d'apprentissage"},null,null,null,{"$f":"Réglages!$F$51","v":"Résultats "},null,{"$f":"Réglages!$F$52","v":"Je me projette"},null,null,null,null,-1,0,1,"réf",null,"n colonne","n ligne "]
[null,null,null,null,null,null,null,null,null,null,null,null,null,null,null,null,null,null,"",null,null,null,null,null,null,null,null,null,{"$f":"IF(S145=\"\",\"\",INDEX($AZ$10:$BG$10,MATCH(S145,$AZ$8:$BG$8,0)))","v":""},null,null,null,null,null,null,null,null,null,"3/ sit3",null,null,null,{"$f":"IF(AG145=\"\",\"\",ISNUMBER(MATCH(AG145,IF(AW145=1,$AZ$12:$AZ$26,IF(AW145=2,$BA$12:$BA$26,IF(AW145=3,$BB$12:$BB$26,IF(AW145=4,$BC$12:$BC$26,IF(AW145=5,$BD$12:$BD$26,IF(AW$5=6,$BE$12:$BE$26,IF(AW145=7,$BF$12:$BF$26,IF(AW145=8,$BG$12:$BG$26,1)))))))),0)))","v":""},{"$f":"IFERROR(INDEX($AZ$12:$BG$26,AX145-1,AW145),\"\")","v":""},{"$f":"IFERROR(INDEX($AZ$12:$BG$26,AX145,AW145),\"\")","v":""},{"$f":"IFERROR(INDEX($AZ$12:$BG$26,AX145+1,AW145),\"\")","v":""},"Sit de Réf",null,{"$f":"VALUE(RIGHT(AC145,1))","v":{"$error":"#VALUE!"}},{"$f":"VALUE(LEFT(AG145,2))","v":{"$error":"#VALUE!"}},{"$f":"IF(AM145=\"\",\"\",IF(AM145=AU145,AU145,ISNUMBER(MATCH(AM145,IF(AW145=1,$AZ$12:$AZ$26,IF(AW145=2,$BA$12:$BA$26,IF(AW145=3,$BB$12:$BB$26,IF(AW145=4,$BC$12:$BC$26,IF(AW145=5,$BD$12:$BD$26,IF(AW$5=6,$BE$12:$BE$26,IF(AW145=7,$BF$12:$BF$26,IF(AW145=8,$BG$12:$BG$26,1)))))))),0))))","v":false}]
[null,null,null,null,null,null,null,null,null,null,null,null,null,null,null,null,null,null,"",null,null,null,null,null,null,null,null,null,"",null,null,null,null,null,null,null,null,null,null,null,null,null,{"$f":"IF(AG146=\"\",\"\",ISNUMBER(MATCH(AG146,IF(AW146=1,$AZ$12:$AZ$26,IF(AW146=2,$BA$12:$BA$26,IF(AW146=3,$BB$12:$BB$26,IF(AW146=4,$BC$12:$BC$26,IF(AW146=5,$BD$12:$BD$26,IF(AW$5=6,$BE$12:$BE$26,IF(AW146=7,$BF$12:$BF$26,IF(AW146=8,$BG$12:$BG$26,1)))))))),0)))","v":""},{"$f":"IFERROR(INDEX($AZ$12:$BG$26,AX146-1,AW146),\"\")","v":""},{"$f":"IFERROR(INDEX($AZ$12:$BG$26,AX146,AW146),\"\")","v":""},{"$f":"IFERROR(INDEX($AZ$12:$BG$26,AX146+1,AW146),\"\")","v":""},"Sit de Réf",null,{"$error":"#VALUE!"},{"$f":"VALUE(LEFT(AG146,2))","v":{"$error":"#VALUE!"}},{"$f":"IF(AM146=\"\",\"\",IF(AM146=AU146,AU146,ISNUMBER(MATCH(AM146,IF(AW146=1,$AZ$12:$AZ$26,IF(AW146=2,$BA$12:$BA$26,IF(AW146=3,$BB$12:$BB$26,IF(AW146=4,$BC$12:$BC$26,IF(AW146=5,$BD$12:$BD$26,IF(AW$5=6,$BE$12:$BE$26,IF(AW146=7,$BF$12:$BF$26,IF(AW146=8,$BG$12:$BG$26,1)))))))),0))))","v":""}]
[null,null,null,null,null,null,null,null,null,null,null,null,null,null,null,null,null,null,"",null,null,null,null,null,null,null,null,null,"",null,null,null,null,null,null,null,null,null,null,null,null,null,"","","","","Sit de Réf",null,{"$error":"#VALUE!"},{"$error":"#VALUE!"},""]
[null,null,null,null,null,null,null,null,null,null,null,null,null,null,null,null,null,null,"",null,null,null,null,null,null,null,null,null,"",null,null,null,null,null,null,null,null,null,null,null,null,null,"","","","","Sit de Réf",null,{"$error":"#VALUE!"},{"$error":"#VALUE!"},""]
[null,null,null,null,null,null,null,null,null,null,null,null,null,null,null,null,null,null,"",null,null,null,null,null,null,null,null,null,"",null,null,null,null,null,null,null,null,null,null,null,null,null,"","","","","Sit de Réf",null,{"$error":"#VALUE!"},{"$error":"#VALUE!"},""]
[null,null,null,null,null,null,null,null,null,null,null,null,null,null,null,null,null,null,"",null,null,null,null,null,null,null,null,null,"",null,null,null,null,null,null,null,null,null,null,null,null,null,"","","","","Sit de Réf",null,{"$error":"#VALUE!"},{"$error":"#VALUE!"},""]
[null,null,null,null,null,null,null,null,null,null,null,null,null,null,null,null,null,null,"",null,null,null,null,null,null,null,null,null,"",null,null,null,null,null,null,null,null,null,null,null,null,null,"","","","","Sit de Réf",null,{"$error":"#VALUE!"},{"$error":"#VALUE!"},""]
[null,null,null,null,null,null,null,null,null,null,null,null,null,null,null,null,null,null,"",null,null,null,null,null,null,null,null,null,"",null,null,null,null,null,null,null,null,null,null,null,null,null,"","","","","Sit de Réf",null,{"$error":"#VALUE!"},{"$error":"#VALUE!"},""]
[null,null,null,null,null,null,null,null,null,null,null,null,null,null,null,null,null,null,"",null,null,null,null,null,null,null,null,null,"",null,null,null,null,null,null,null,null,null,null,null,null,null,"","","","","Sit de Réf",null,{"$error":"#VALUE!"},{"$error":"#VALUE!"},"",{"$f":"$AZ$9","v":"Moteur "},{"$f":"$BA$9","v":"Non moteur"},{"$f":"$BB$9","v":"Quel enjeu ?"},{"$f":"$BC$9","v":""},{"$f":"$BD$9","v":""},{"$f":"$BE$9","v":""},{"$f":"$BF$9","v":""},{"$f":"$BG$9","v":""}]
[null,null,null,null,null,null,null,null,null,null,null,null,null,null,null,null,null,null,"",null,null,null,null,null,null,null,null,null,"",null,null,null,null,null,null,null,null,null,null,null,null,null,"","","","","Sit de Réf",null,{"$error":"#VALUE!"},{"$error":"#VALUE!"},"",{"$f":"IF(Réglages!$B$12=\"\",\"\",\"Sit de Réf :  \"&Réglages!$B$12)","v":"Sit de Réf :  Le sablier"},{"$f":"IF(Réglages!$C$12=\"\",\"\",\"Sit de Réf :  \"&Réglages!$C$12)","v":""},{"$f":"IF(Réglages!$D$12=\"\",\"\",\"Sit de Réf :  \"&Réglages!$D$12)","v":""},{"$f":"IF(Réglages!$E$12=\"\",\"\",\"Sit de Réf :  \"&Réglages!$E$12)","v":""},{"$f":"IF(Réglages!$F$12=\"\",\"\",\"Sit de Réf :  \"&Réglages!$F$12)","v":""},{"$f":"IF(Réglages!$G$12=\"\",\"\",\"Sit de Réf :  \"&Réglages!$G$12)","v":""},{"$f":"IF(Réglages!$H$12=\"\",\"\",\"Sit de Réf :  \"&Réglages!$H$12)","v":""},{"$f":"IF(Réglages!$I$12=\"\",\"\",\"Sit de Réf :  \"&Réglages!$I$12)","v":""}]
[null,null,null,null,null,null,null,null,null,null,null,null,null,null,null,null,null,null,{"$f":"Réglages!$F$53","v":"Enjeu de travail principal de cette leçon >"},null,null,null,null,null,"",null,null,null,null,null,null,null,{"$f":"IF(Y155=\"\",\"\",IF(Y155=$AZ$39,$AZ$34,IF(Y155=$BA$39,$BA$34,IF(Y155=$BB$39,$BB$34,IF(Y155=$BC$39,$BC$34,IF(Y155=$BD$39,$BD$34,IF(Y155=$BE$39,$BE$34,IF(Y155=$BF$39,$BF$34,$BG$34))))))))","v":""},null,{"$f":"Réglages!$H$50","v":"Critères rappel >"},null,"C2 fggzev",null,{"$f":"Réglages!$H$51","v":"Je me situe >"},null,null,null,{"$f":"IF(AK155=\"\",\"\",ISNUMBER(MATCH(AK155,IF(AT155=1,$AZ$35:$AZ$38,IF(AT155=2,$BA$35:$BA$38,IF(AT155=3,$BB$35:$BB$38,IF(AT155=4,$BC$35:$BC$38,IF(AT155=5,$BD$35:$BD$38,IF(AW$5=6,$BE$35:$BE$38,IF(AT155=7,$BF$35:$BF$38,IF(AT155=8,$BG$35:$BG$38,1)))))))),0)))","v":false},"droite axe !!!!",{"$f":"IF(Y155=\"\",\"\",INDEX($AZ$10:$BG$10,MATCH(Y155,$AZ$8:$BG$8,0)))","v":""},{"$f":"VALUE(RIGHT(AS155,1))","v":{"$error":"#VALUE!"}},null,null,null,null,"c1",{"$f":"IF(Réglages!$B$14=\"\",\"\",\"C1 \"&Réglages!$B$14)","v":"C1 9 points"},{"$f":"IF(Réglages!$C$14=\"\",\"\",\"C1 \"&Réglages!$C$14)","v":""},{"$f":"IF(Réglages!$D$14=\"\",\"\",\"C1 \"&Réglages!$D$14)","v":""},{"$f":"IF(Réglages!$E$14=\"\",\"\",\"C1 \"&Réglages!$E$14)","v":""},{"$f":"IF(Réglages!$F$14=\"\",\"\",\"C1 \"&Réglages!$F$14)","v":""},{"$f":"IF(Réglages!$G$14=\"\",\"\",\"C1 \"&Réglages!$G$14)","v":""},{"$f":"IF(Réglages!$H$14=\"\",\"\",\"C1 \"&Réglages!$H$14)","v":""},{"$f":"IF(Réglages!$I$14=\"\",\"\",\"C1 \"&Réglages!$I$14)","v":""}]
[null,null,null,null,null,null,null,null,null,null,null,null,null,null,null,null,null,null,{"$f":"Réglages!$F$54","v":"Enjeu de travail secondaire de cette leçon >"},null,null,null,null,null,"",null,null,null,null,null,null,null,{"$f":"IF(Y156=\"\",\"\",IF(Y156=$AZ$40,$AZ$35,IF(Y156=$BA$40,$BA$35,IF(Y156=$BB$40,$BB$35,IF(Y156=$BC$40,$BC$35,IF(Y156=$BD$40,$BD$35,IF(Y156=$BE$40,$BE$35,IF(Y156=$BF$40,$BF$35,$BG$35))))))))","v":""},null,{"$f":"Réglages!$H$50","v":"Critères rappel >"},null,"C1 j",null,{"$f":"Réglages!$H$51","v":"Je me situe >"},null,null,null,{"$f":"IF(AK156=\"\",\"\",ISNUMBER(MATCH(AK156,IF(AT156=1,$AZ$35:$AZ$38,IF(AT156=2,$BA$35:$BA$38,IF(AT156=3,$BB$35:$BB$38,IF(AT156=4,$BC$35:$BC$38,IF(AT156=5,$BD$35:$BD$38,IF(AW$5=6,$BE$35:$BE$38,IF(AT156=7,$BF$35:$BF$38,IF(AT156=8,$BG$35:$BG$38,1)))))))),0)))","v":false},null,{"$f":"IF(Y156=\"\",\"\",INDEX($AZ$10:$BG$10,MATCH(Y156,$AZ$8:$BG$8,0)))","v":""},{"$f":"VALUE(RIGHT(AS156,1))","v":{"$error":"#VALUE!"}},null,"SI(AE35=AZ39;AZ35:AZ38;SI(AE35=BA39;BA35:BA38;SI(AE35=Bb39;Bb35:Bb38;SI(AE35=Bc39;Bc35:Bc38;SI(AE35=Bd39;Bd35:Bd38;SI(AE35=Be39;Be35:Be38;SI(AE35=Bf39;Bf35:Bf38;SI(AE35=Bg39;Bg35:Bg38;AY35:AY38))))))))",null,null,"c2",{"$f":"IF(Réglages!$B$15=\"\",\"\",\"C2 \"&Réglages!$B$15)","v":"C2 99 points"},{"$f":"IF(Réglages!$C$15=\"\",\"\",\"C2 \"&Réglages!$C$15)","v":""},{"$f":"IF(Réglages!$D$15=\"\",\"\",\"C2 \"&Réglages!$D$15)","v":""},{"$f":"IF(Réglages!$E$15=\"\",\"\",\"C2 \"&Réglages!$E$15)","v":""},{"$f":"IF(Réglages!$F$15=\"\",\"\",\"C2 \"&Réglages!$F$15)","v":""},{"$f":"IF(Réglages!$G$15=\"\",\"\",\"C2 \"&Réglages!$G$15)","v":""},{"$f":"IF(Réglages!$H$15=\"\",\"\",\"C2 \"&Réglages!$H$15)","v":""},{"$f":"IF(Réglages!$I$15=\"\",\"\",\"C2 \"&Réglages!$I$15)","v":""}]
[null,null,null,null,null,null,null,null,null,null,null,null,null,null,null,null,null,null,{"$f":" Réglages!$H$52&AR143&\" >\"","v":"Mon Projet pour L8 >"},null,null,null,null,null,null,null,null,null,null,null,null,null,null,null,null,null,null,null,{"$f":"Réglages!$H$53&AR143&\" >\"","v":"Mon Axe Pioritaire en L8 >"},null,"",null,null,null,null,null,null,null,null,null,"c3",{"$f":"IF(Réglages!$B$16=\"\",\"\",\"C3 \"&Réglages!$B$16)","v":"C3 999 pts "},{"$f":"IF(Réglages!$C$16=\"\",\"\",\"C3 \"&Réglages!$C$16)","v":""},{"$f":"IF(Réglages!$D$16=\"\",\"\",\"C3 \"&Réglages!$D$16)","v":""},{"$f":"IF(Réglages!$E$16=\"\",\"\",\"C3 \"&Réglages!$E$16)","v":""},{"$f":"IF(Réglages!$F$16=\"\",\"\",\"C3 \"&Réglages!$F$16)","v":""},{"$f":"IF(Réglages!$G$16=\"\",\"\",\"C3 \"&Réglages!$G$16)","v":""},{"$f":"IF(Réglages!$H$16=\"\",\"\",\"C3 \"&Réglages!$H$16)","v":""},{"$f":"IF(Réglages!$I$16=\"\",\"\",\"C3 \"&Réglages!$I$16)","v":""}]
[null,null,null,null,null,null,null,null,null,null,null,null,null,null,null,null,null,null,null,null,null,null,null,null,null,null,null,null,null,null,null,null,null,null,null,null,null,null,null,null,null,null,null,null,null,null,null,null,null,null,"c4",{"$f":"IF(Réglages!$B$17=\"\",\"\",\"C4 \"&Réglages!$B$17)","v":"C4 9999 pts"},{"$f":"IF(Réglages!$C$17=\"\",\"\",\"C4 \"&Réglages!$C$17)","v":""},{"$f":"IF(Réglages!$D$17=\"\",\"\",\"C4 \"&Réglages!$D$17)","v":""},{"$f":"IF(Réglages!$E$17=\"\",\"\",\"C4 \"&Réglages!$E$17)","v":""},{"$f":"IF(Réglages!$F$17=\"\",\"\",\"C4 \"&Réglages!$F$17)","v":""},{"$f":"IF(Réglages!$G$17=\"\",\"\",\"C4 \"&Réglages!$G$17)","v":""},{"$f":"IF(Réglages!$H$17=\"\",\"\",\"C4 \"&Réglages!$H$17)","v":""},{"$f":"IF(Réglages!$I$17=\"\",\"\",\"C4 \"&Réglages!$I$17)","v":""}]
[null,null,null,null,null,null,null,null,null,null,null,null,null,null,null,null,null,null,null,null,null,null,null,null,null,null,null,null,null,null,null,null,null,null,null,null,null,null,null,null,null,null,null,null,null,null,null,null,null,null,{"$f":"Réglages!$L$5","v":"Moteur "},{"$f":"IF($AZ$8=\"\",\"\",$AZ$8)","v":"Le serveur "},{"$f":"IF($BA$8=\"\",\"\",$BA$8)","v":"Observateur"},{"$f":"IF($BB$8=\"\",\"\",$BB$8)","v":"?"},{"$f":"IF($BC$8=\"\",\"\",$BC$8)","v":""},{"$f":"IF($BD$8=\"\",\"\",$BD$8)","v":""},{"$f":"IF($BE$8=\"\",\"\",$BE$8)","v":""},{"$f":"IF($BF$8=\"\",\"\",$BF$8)","v":""},{"$f":"IF($BG$8=\"\",\"\",$BG$8)","v":""}]
[null,null,null,null,null,null,null,null,null,null,null,null,null,null,null,null,null,null,null,null,null,null,null,null,null,null,null,null,null,null,null,null,null,null,null,null,null,null,null,null,null,null,null,null,null,null,null,null,null,null,{"$f":"Réglages!$L$6","v":"Non moteur"},{"$f":"IF($AZ$8=\"\",\"\",$AZ$8)","v":"Le serveur "},{"$f":"IF($BA$8=\"\",\"\",$BA$8)","v":"Observateur"},{"$f":"IF($BB$8=\"\",\"\",$BB$8)","v":"?"},{"$f":"IF($BC$8=\"\",\"\",$BC$8)","v":""},{"$f":"IF($BD$8=\"\",\"\",$BD$8)","v":""},{"$f":"IF($BE$8=\"\",\"\",$BE$8)","v":""},{"$f":"IF($BF$8=\"\",\"\",$BF$8)","v":""},{"$f":"IF($BG$8=\"\",\"\",$BG$8)","v":""}]
[]
[]
["Leçon 8",null,null,null,null,null,null,null,null,null,null,null,null,null,null,null,null,null,null,null,null,null,null,null,null,null,null,null,null,null,null,null,null,null,null,null,null,null,null,null,null,null,null,{"$f":"RIGHT(A163,1)+1","v":9},{"$f":"MATCH(AG165,IF(AW165=1,AZ152:AZ161,IF(AW165=2,BA152:BA161,1)),0)","v":{"$error":"#VALUE!"}},{"$f":"OR(AND(AW165=1,MATCH(AG165,AZ152:AZ161,0)),(AND(AW165=2,MATCH(AG165,BA152:BA161,0))))","v":{"$error":"#VALUE!"}}]
[null,null,null,null,null,null,null,null,null,null,null,null,null,null,null,null,null,null,{"$f":"Réglages!$D$54","v":"Axes de Travail "},null,null,null,null,null,null,null,null,null,null,null,null,null,{"$f":"Réglages!$F$50","v":"Situations d'apprentissage"},null,null,null,{"$f":"Réglages!$F$51","v":"Résultats "},null,{"$f":"Réglages!$F$52","v":"Je me projette"},null,null,null,null,-1,0,1,"réf",null,"n colonne","n ligne "]
[null,null,null,null,null,null,null,null,null,null,null,null,null,null,null,null,null,null,"",null,null,null,null,null,null,null,null,null,{"$f":"IF(S165=\"\",\"\",INDEX($AZ$10:$BG$10,MATCH(S165,$AZ$8:$BG$8,0)))","v":""},null,null,null,null,null,null,null,null,null,"3/ sit3",null,null,null,{"$f":"IF(AG165=\"\",\"\",ISNUMBER(MATCH(AG165,IF(AW165=1,$AZ$12:$AZ$26,IF(AW165=2,$BA$12:$BA$26,IF(AW165=3,$BB$12:$BB$26,IF(AW165=4,$BC$12:$BC$26,IF(AW165=5,$BD$12:$BD$26,IF(AW$5=6,$BE$12:$BE$26,IF(AW165=7,$BF$12:$BF$26,IF(AW165=8,$BG$12:$BG$26,1)))))))),0)))","v":""},{"$f":"IFERROR(INDEX($AZ$12:$BG$26,AX165-1,AW165),\"\")","v":""},{"$f":"IFERROR(INDEX($AZ$12:$BG$26,AX165,AW165),\"\")","v":""},{"$f":"IFERROR(INDEX($AZ$12:$BG$26,AX165+1,AW165),\"\")","v":""},"Sit de Réf",null,{"$f":"VALUE(RIGHT(AC165,1))","v":{"$error":"#VALUE!"}},{"$f":"VALUE(LEFT(AG165,2))","v":{"$error":"#VALUE!"}},{"$f":"IF(AM165=\"\",\"\",IF(AM165=AU165,AU165,ISNUMBER(MATCH(AM165,IF(AW165=1,$AZ$12:$AZ$26,IF(AW165=2,$BA$12:$BA$26,IF(AW165=3,$BB$12:$BB$26,IF(AW165=4,$BC$12:$BC$26,IF(AW165=5,$BD$12:$BD$26,IF(AW$5=6,$BE$12:$BE$26,IF(AW165=7,$BF$12:$BF$26,IF(AW165=8,$BG$12:$BG$26,1)))))))),0))))","v":false}]
[null,null,null,null,null,null,null,null,null,null,null,null,null,null,null,null,null,null,"",null,null,null,null,null,null,null,null,null,"",null,null,null,null,null,null,null,null,null,null,null,null,null,{"$f":"IF(AG166=\"\",\"\",ISNUMBER(MATCH(AG166,IF(AW166=1,$AZ$12:$AZ$26,IF(AW166=2,$BA$12:$BA$26,IF(AW166=3,$BB$12:$BB$26,IF(AW166=4,$BC$12:$BC$26,IF(AW166=5,$BD$12:$BD$26,IF(AW$5=6,$BE$12:$BE$26,IF(AW166=7,$BF$12:$BF$26,IF(AW166=8,$BG$12:$BG$26,1)))))))),0)))","v":""},{"$f":"IFERROR(INDEX($AZ$12:$BG$26,AX166-1,AW166),\"\")","v":""},{"$f":"IFERROR(INDEX($AZ$12:$BG$26,AX166,AW166),\"\")","v":""},{"$f":"IFERROR(INDEX($AZ$12:$BG$26,AX166+1,AW166),\"\")","v":""},"Sit de Réf",null,{"$error":"#VALUE!"},{"$f":"VALUE(LEFT(AG166,2))","v":{"$error":"#VALUE!"}},{"$f":"IF(AM166=\"\",\"\",IF(AM166=AU166,AU166,ISNUMBER(MATCH(AM166,IF(AW166=1,$AZ$12:$AZ$26,IF(AW166=2,$BA$12:$BA$26,IF(AW166=3,$BB$12:$BB$26,IF(AW166=4,$BC$12:$BC$26,IF(AW166=5,$BD$12:$BD$26,IF(AW$5=6,$BE$12:$BE$26,IF(AW166=7,$BF$12:$BF$26,IF(AW166=8,$BG$12:$BG$26,1)))))))),0))))","v":""}]
[null,null,null,null,null,null,null,null,null,null,null,null,null,null,null,null,null,null,"",null,null,null,null,null,null,null,null,null,"",null,null,null,null,null,null,null,null,null,null,null,null,null,"","","","","Sit de Réf",null,{"$error":"#VALUE!"},{"$error":"#VALUE!"},""]
[null,null,null,null,null,null,null,null,null,null,null,null,null,null,null,null,null,null,"",null,null,null,null,null,null,null,null,null,"",null,null,null,null,null,null,null,null,null,null,null,null,null,"","","","","Sit de Réf",null,{"$error":"#VALUE!"},{"$error":"#VALUE!"},""]
[null,null,null,null,null,null,null,null,null,null,null,null,null,null,null,null,null,null,"",null,null,null,null,null,null,null,null,null,"",null,null,null,null,null,null,null,null,null,null,null,null,null,"","","","","Sit de Réf",null,{"$error":"#VALUE!"},{"$error":"#VALUE!"},""]
[null,null,null,null,null,null,null,null,null,null,null,null,null,null,null,null,null,null,"",null,null,null,null,null,null,null,null,null,"",null,null,null,null,null,null,null,null,null,null,null,null,null,"","","","","Sit de Réf",null,{"$error":"#VALUE!"},{"$error":"#VALUE!"},""]
[null,null,null,null,null,null,null,null,null,null,null,null,null,null,null,null,null,null,"",null,null,null,null,null,null,null,null,null,"",null,null,null,null,null,null,null,null,null,null,null,null,null,"","","","","Sit de Réf",null,{"$error":"#VALUE!"},{"$error":"#VALUE!"},""]
[null,null,null,null,null,null,null,null,null,null,null,null,null,null,null,null,null,null,"",null,null,null,null,null,null,null,null,null,"",null,null,null,null,null,null,null,null,null,null,null,null,null,"","","","","Sit de Réf",null,{"$error":"#VALUE!"},{"$error":"#VALUE!"},""]
[null,null,null,null,null,null,null,null,null,null,null,null,null,null,null,null,null,null,"",null,null,null,null,null,null,null,null,null,"",null,null,null,null,null,null,null,null,null,null,null,null,null,"","","","","Sit de Réf",null,{"$error":"#VALUE!"},{"$error":"#VALUE!"},"",{"$f":"$AZ$9","v":"Moteur "},{"$f":"$BA$9","v":"Non moteur"},{"$f":"$BB$9","v":"Quel enjeu ?"},{"$f":"$BC$9","v":""},{"$f":"$BD$9","v":""},{"$f":"$BE$9","v":""},{"$f":"$BF$9","v":""},{"$f":"$BG$9","v":""}]
[null,null,null,null,null,null,null,null,null,null,null,null,null,null,null,null,null,null,"",null,null,null,null,null,null,null,null,null,"",null,null,null,null,null,null,null,null,null,null,null,null,null,"","","","","Sit de Réf",null,{"$error":"#VALUE!"},{"$error":"#VALUE!"},"",{"$f":"IF(Réglages!$B$12=\"\",\"\",\"Sit de Réf :  \"&Réglages!$B$12)","v":"Sit de Réf :  Le sablier"},{"$f":"IF(Réglages!$C$12=\"\",\"\",\"Sit de Réf :  \"&Réglages!$C$12)","v":""},{"$f":"IF(Réglages!$D$12=\"\",\"\",\"Sit de Réf :  \"&Réglages!$D$12)","v":""},{"$f":"IF(Réglages!$E$12=\"\",\"\",\"Sit de Réf :  \"&Réglages!$E$12)","v":""},{"$f":"IF(Réglages!$F$12=\"\",\"\",\"Sit de Réf :  \"&Réglages!$F$12)","v":""},{"$f":"IF(Réglages!$G$12=\"\",\"\",\"Sit de Réf :  \"&Réglages!$G$12)","v":""},{"$f":"IF(Réglages!$H$12=\"\",\"\",\"Sit de Réf :  \"&Réglages!$H$12)","v":""},{"$f":"IF(Réglages!$I$12=\"\",\"\",\"Sit de Réf :  \"&Réglages!$I$12)","v":""}]
[null,null,null,null,null,null,null,null,null,null,null,null,null,null,null,null,null,null,{"$f":"Réglages!$F$53","v":"Enjeu de travail principal de cette leçon >"},null,null,null,null,null,"",null,null,null,null,null,null,null,{"$f":"IF(Y175=\"\",\"\",IF(Y175=$AZ$39,$AZ$34,IF(Y175=$BA$39,$BA$34,IF(Y175=$BB$39,$BB$34,IF(Y175=$BC$39,$BC$34,IF(Y175=$BD$39,$BD$34,IF(Y175=$BE$39,$BE$34,IF(Y175=$BF$39,$BF$34,$BG$34))))))))","v":""},null,{"$f":"Réglages!$H$50","v":"Critères rappel >"},null,"C2 fggzev",null,{"$f":"Réglages!$H$51","v":"Je me situe >"},null,null,null,{"$f":"IF(AK175=\"\",\"\",ISNUMBER(MATCH(AK175,IF(AT175=1,$AZ$35:$AZ$38,IF(AT175=2,$BA$35:$BA$38,IF(AT175=3,$BB$35:$BB$38,IF(AT175=4,$BC$35:$BC$38,IF(AT175=5,$BD$35:$BD$38,IF(AW$5=6,$BE$35:$BE$38,IF(AT175=7,$BF$35:$BF$38,IF(AT175=8,$BG$35:$BG$38,1)))))))),0)))","v":false},"droite axe !!!!",{"$f":"IF(Y175=\"\",\"\",INDEX($AZ$10:$BG$10,MATCH(Y175,$AZ$8:$BG$8,0)))","v":""},{"$f":"VALUE(RIGHT(AS175,1))","v":{"$error":"#VALUE!"}},null,null,null,null,"c1",{"$f":"IF(Réglages!$B$14=\"\",\"\",\"C1 \"&Réglages!$B$14)","v":"C1 9 points"},{"$f":"IF(Réglages!$C$14=\"\",\"\",\"C1 \"&Réglages!$C$14)","v":""},{"$f":"IF(Réglages!$D$14=\"\",\"\",\"C1 \"&Réglages!$D$14)","v":""},{"$f":"IF(Réglages!$E$14=\"\",\"\",\"C1 \"&Réglages!$E$14)","v":""},{"$f":"IF(Réglages!$F$14=\"\",\"\",\"C1 \"&Réglages!$F$14)","v":""},{"$f":"IF(Réglages!$G$14=\"\",\"\",\"C1 \"&Réglages!$G$14)","v":""},{"$f":"IF(Réglages!$H$14=\"\",\"\",\"C1 \"&Réglages!$H$14)","v":""},{"$f":"IF(Réglages!$I$14=\"\",\"\",\"C1 \"&Réglages!$I$14)","v":""}]
[null,null,null,null,null,null,null,null,null,null,null,null,null,null,null,null,null,null,{"$f":"Réglages!$F$54","v":"Enjeu de travail secondaire de cette leçon >"},null,null,null,null,null,"",null,null,null,null,null,null,null,{"$f":"IF(Y176=\"\",\"\",IF(Y176=$AZ$40,$AZ$35,IF(Y176=$BA$40,$BA$35,IF(Y176=$BB$40,$BB$35,IF(Y176=$BC$40,$BC$35,IF(Y176=$BD$40,$BD$35,IF(Y176=$BE$40,$BE$35,IF(Y176=$BF$40,$BF$35,$BG$35))))))))","v":""},null,{"$f":"Réglages!$H$50","v":"Critères rappel >"},null,"C1 j",null,{"$f":"Réglages!$H$51","v":"Je me situe >"},null,null,null,{"$f":"IF(AK176=\"\",\"\",ISNUMBER(MATCH(AK176,IF(AT176=1,$AZ$35:$AZ$38,IF(AT176=2,$BA$35:$BA$38,IF(AT176=3,$BB$35:$BB$38,IF(AT176=4,$BC$35:$BC$38,IF(AT176=5,$BD$35:$BD$38,IF(AW$5=6,$BE$35:$BE$38,IF(AT176=7,$BF$35:$BF$38,IF(AT176=8,$BG$35:$BG$38,1)))))))),0)))","v":false},null,{"$f":"IF(Y176=\"\",\"\",INDEX($AZ$10:$BG$10,MATCH(Y176,$AZ$8:$BG$8,0)))","v":""},{"$f":"VALUE(RIGHT(AS176,1))","v":{"$error":"#VALUE!"}},null,"SI(AE35=AZ39;AZ35:AZ38;SI(AE35=BA39;BA35:BA38;SI(AE35=Bb39;Bb35:Bb38;SI(AE35=Bc39;Bc35:Bc38;SI(AE35=Bd39;Bd35:Bd38;SI(AE35=Be39;Be35:Be38;SI(AE35=Bf39;Bf35:Bf38;SI(AE35=Bg39;Bg35:Bg38;AY35:AY38))))))))",null,null,"c2",{"$f":"IF(Réglages!$B$15=\"\",\"\",\"C2 \"&Réglages!$B$15)","v":"C2 99 points"},{"$f":"IF(Réglages!$C$15=\"\",\"\",\"C2 \"&Réglages!$C$15)","v":""},{"$f":"IF(Réglages!$D$15=\"\",\"\",\"C2 \"&Réglages!$D$15)","v":""},{"$f":"IF(Réglages!$E$15=\"\",\"\",\"C2 \"&Réglages!$E$15)","v":""},{"$f":"IF(Réglages!$F$15=\"\",\"\",\"C2 \"&Réglages!$F$15)","v":""},{"$f":"IF(Réglages!$G$15=\"\",\"\",\"C2 \"&Réglages!$G$15)","v":""},{"$f":"IF(Réglages!$H$15=\"\",\"\",\"C2 \"&Réglages!$H$15)","v":""},{"$f":"IF(Réglages!$I$15=\"\",\"\",\"C2 \"&Réglages!$I$15)","v":""}]
[null,null,null,null,null,null,null,null,null,null,null,null,null,null,null,null,null,null,{"$f":" Réglages!$H$52&AR163&\" >\"","v":"Mon Projet pour L9 >"},null,null,null,null,null,null,null,null,null,null,null,null,null,null,null,null,null,null,null,{"$f":"Réglages!$H$53&AR163&\" >\"","v":"Mon Axe Pioritaire en L9 >"},null,"",null,null,null,null,null,null,null,null,null,"c3",{"$f":"IF(Réglages!$B$16=\"\",\"\",\"C3 \"&Réglages!$B$16)","v":"C3 999 pts "},{"$f":"IF(Réglages!$C$16=\"\",\"\",\"C3 \"&Réglages!$C$16)","v":""},{"$f":"IF(Réglages!$D$16=\"\",\"\",\"C3 \"&Réglages!$D$16)","v":""},{"$f":"IF(Réglages!$E$16=\"\",\"\",\"C3 \"&Réglages!$E$16)","v":""},{"$f":"IF(Réglages!$F$16=\"\",\"\",\"C3 \"&Réglages!$F$16)","v":""},{"$f":"IF(Réglages!$G$16=\"\",\"\",\"C3 \"&Réglages!$G$16)","v":""},{"$f":"IF(Réglages!$H$16=\"\",\"\",\"C3 \"&Réglages!$H$16)","v":""},{"$f":"IF(Réglages!$I$16=\"\",\"\",\"C3 \"&Réglages!$I$16)","v":""}]
[null,null,null,null,null,null,null,null,null,null,null,null,null,null,null,null,null,null,null,null,null,null,null,null,null,null,null,null,null,null,null,null,null,null,null,null,null,null,null,null,null,null,null,null,null,null,null,null,null,null,"c4",{"$f":"IF(Réglages!$B$17=\"\",\"\",\"C4 \"&Réglages!$B$17)","v":"C4 9999 pts"},{"$f":"IF(Réglages!$C$17=\"\",\"\",\"C4 \"&Réglages!$C$17)","v":""},{"$f":"IF(Réglages!$D$17=\"\",\"\",\"C4 \"&Réglages!$D$17)","v":""},{"$f":"IF(Réglages!$E$17=\"\",\"\",\"C4 \"&Réglages!$E$17)","v":""},{"$f":"IF(Réglages!$F$17=\"\",\"\",\"C4 \"&Réglages!$F$17)","v":""},{"$f":"IF(Réglages!$G$17=\"\",\"\",\"C4 \"&Réglages!$G$17)","v":""},{"$f":"IF(Réglages!$H$17=\"\",\"\",\"C4 \"&Réglages!$H$17)","v":""},{"$f":"IF(Réglages!$I$17=\"\",\"\",\"C4 \"&Réglages!$I$17)","v":""}]
[null,null,null,null,null,null,null,null,null,null,null,null,null,null,null,null,null,null,null,null,null,null,null,null,null,null,null,null,null,null,null,null,null,null,null,null,null,null,null,null,null,null,null,null,null,null,null,null,null,null,{"$f":"Réglages!$L$5","v":"Moteur "},{"$f":"IF($AZ$8=\"\",\"\",$AZ$8)","v":"Le serveur "},{"$f":"IF($BA$8=\"\",\"\",$BA$8)","v":"Observateur"},{"$f":"IF($BB$8=\"\",\"\",$BB$8)","v":"?"},{"$f":"IF($BC$8=\"\",\"\",$BC$8)","v":""},{"$f":"IF($BD$8=\"\",\"\",$BD$8)","v":""},{"$f":"IF($BE$8=\"\",\"\",$BE$8)","v":""},{"$f":"IF($BF$8=\"\",\"\",$BF$8)","v":""},{"$f":"IF($BG$8=\"\",\"\",$BG$8)","v":""}]
[null,null,null,null,null,null,null,null,null,null,null,null,null,null,null,null,null,null,null,null,null,null,null,null,null,null,null,null,null,null,null,null,null,null,null,null,null,null,null,null,null,null,null,null,null,null,null,null,null,null,{"$f":"Réglages!$L$6","v":"Non moteur"},{"$f":"IF($AZ$8=\"\",\"\",$AZ$8)","v":"Le serveur "},{"$f":"IF($BA$8=\"\",\"\",$BA$8)","v":"Observateur"},{"$f":"IF($BB$8=\"\",\"\",$BB$8)","v":"?"},{"$f":"IF($BC$8=\"\",\"\",$BC$8)","v":""},{"$f":"IF($BD$8=\"\",\"\",$BD$8)","v":""},{"$f":"IF($BE$8=\"\",\"\",$BE$8)","v":""},{"$f":"IF($BF$8=\"\",\"\",$BF$8)","v":""},{"$f":"IF($BG$8=\"\",\"\",$BG$8)","v":""}]
[]
[]
[null,null,null,null,null,null,null,null,null,null,null,null,null,null,null,null,null,"Leçon 9",null,null,null,null,null,null,null,null,null,null,null,null,null,null,null,null,null,null,null,null,null,null,null,null,null,{"$f":"RIGHT(R183,1)+1","v":10},{"$f":"MATCH(AG185,IF(AW185=1,AZ172:AZ181,IF(AW185=2,BA172:BA181,1)),0)","v":{"$error":"#VALUE!"}},{"$f":"OR(AND(AW185=1,MATCH(AG185,AZ172:AZ181,0)),(AND(AW185=2,MATCH(AG185,BA172:BA181,0))))","v":{"$error":"#VALUE!"}}]
[null,null,null,null,null,null,null,null,null,null,null,null,null,null,null,null,null,null,{"$f":"Réglages!$D$54","v":"Axes de Travail "},null,null,null,null,null,null,null,null,null,null,null,null,null,{"$f":"Réglages!$F$50","v":"Situations d'apprentissage"},null,null,null,{"$f":"Réglages!$F$51","v":"Résultats "},null,{"$f":"Réglages!$F$52","v":"Je me projette"},null,null,null,null,-1,0,1,"réf",null,"n colonne","n ligne "]
[null,null,null,null,null,null,null,null,null,null,null,null,null,null,null,null,null,null,"",null,null,null,null,null,null,null,null,null,{"$f":"IF(S185=\"\",\"\",INDEX($AZ$10:$BG$10,MATCH(S185,$AZ$8:$BG$8,0)))","v":""},null,null,null,null,null,null,null,null,null,"3/ sit3",null,null,null,{"$f":"IF(AG185=\"\",\"\",ISNUMBER(MATCH(AG185,IF(AW185=1,$AZ$12:$AZ$26,IF(AW185=2,$BA$12:$BA$26,IF(AW185=3,$BB$12:$BB$26,IF(AW185=4,$BC$12:$BC$26,IF(AW185=5,$BD$12:$BD$26,IF(AW$5=6,$BE$12:$BE$26,IF(AW185=7,$BF$12:$BF$26,IF(AW185=8,$BG$12:$BG$26,1)))))))),0)))","v":""},{"$f":"IFERROR(INDEX($AZ$12:$BG$26,AX185-1,AW185),\"\")","v":""},{"$f":"IFERROR(INDEX($AZ$12:$BG$26,AX185,AW185),\"\")","v":""},{"$f":"IFERROR(INDEX($AZ$12:$BG$26,AX185+1,AW185),\"\")","v":""},"Sit de Réf",null,{"$f":"VALUE(RIGHT(AC185,1))","v":{"$error":"#VALUE!"}},{"$f":"VALUE(LEFT(AG185,2))","v":{"$error":"#VALUE!"}},{"$f":"IF(AM185=\"\",\"\",IF(AM185=AU185,AU185,ISNUMBER(MATCH(AM185,IF(AW185=1,$AZ$12:$AZ$26,IF(AW185=2,$BA$12:$BA$26,IF(AW185=3,$BB$12:$BB$26,IF(AW185=4,$BC$12:$BC$26,IF(AW185=5,$BD$12:$BD$26,IF(AW$5=6,$BE$12:$BE$26,IF(AW185=7,$BF$12:$BF$26,IF(AW185=8,$BG$12:$BG$26,1)))))))),0))))","v":false}]
[null,null,null,null,null,null,null,null,null,null,null,null,null,null,null,null,null,null,"",null,null,null,null,null,null,null,null,null,"",null,null,null,null,null,null,null,null,null,null,null,null,null,{"$f":"IF(AG186=\"\",\"\",ISNUMBER(MATCH(AG186,IF(AW186=1,$AZ$12:$AZ$26,IF(AW186=2,$BA$12:$BA$26,IF(AW186=3,$BB$12:$BB$26,IF(AW186=4,$BC$12:$BC$26,IF(AW186=5,$BD$12:$BD$26,IF(AW$5=6,$BE$12:$BE$26,IF(AW186=7,$BF$12:$BF$26,IF(AW186=8,$BG$12:$BG$26,1)))))))),0)))","v":""},{"$f":"IFERROR(INDEX($AZ$12:$BG$26,AX186-1,AW186),\"\")","v":""},{"$f":"IFERROR(INDEX($AZ$12:$BG$26,AX186,AW186),\"\")","v":""},{"$f":"IFERROR(INDEX($AZ$12:$BG$26,AX186+1,AW186),\"\")","v":""},"Sit de Réf",null,{"$error":"#VALUE!"},{"$f":"VALUE(LEFT(AG186,2))","v":{"$error":"#VALUE!"}},{"$f":"IF(AM186=\"\",\"\",IF(AM186=AU186,AU186,ISNUMBER(MATCH(AM186,IF(AW186=1,$AZ$12:$AZ$26,IF(AW186=2,$BA$12:$BA$26,IF(AW186=3,$BB$12:$BB$26,IF(AW186=4,$BC$12:$BC$26,IF(AW186=5,$BD$12:$BD$26,IF(AW$5=6,$BE$12:$BE$26,IF(AW186=7,$BF$12:$BF$26,IF(AW186=8,$BG$12:$BG$26,1)))))))),0))))","v":""}]
[null,null,null,null,null,null,null,null,null,null,null,null,null,null,null,null,null,null,"",null,null,null,null,null,null,null,null,null,"",null,null,null,null,null,null,null,null,null,null,null,null,null,"","","","","Sit de Réf",null,{"$error":"#VALUE!"},{"$error":"#VALUE!"},""]
[null,null,null,null,null,null,null,null,null,null,null,null,null,null,null,null,null,null,"",null,null,null,null,null,null,null,null,null,"",null,null,null,null,null,null,null,null,null,null,null,null,null,"","","","","Sit de Réf",null,{"$error":"#VALUE!"},{"$error":"#VALUE!"},""]
[null,null,null,null,null,null,null,null,null,null,null,null,null,null,null,null,null,null,"",null,null,null,null,null,null,null,null,null,"",null,null,null,null,null,null,null,null,null,null,null,null,null,"","","","","Sit de Réf",null,{"$error":"#VALUE!"},{"$error":"#VALUE!"},""]
[null,null,null,null,null,null,null,null,null,null,null,null,null,null,null,null,null,null,"",null,null,null,null,null,null,null,null,null,"",null,null,null,null,null,null,null,null,null,null,null,null,null,"","","","","Sit de Réf",null,{"$error":"#VALUE!"},{"$error":"#VALUE!"},""]
[null,null,null,null,null,null,null,null,null,null,null,null,null,null,null,null,null,null,"",null,null,null,null,null,null,null,null,null,"",null,null,null,null,null,null,null,null,null,null,null,null,null,"","","","","Sit de Réf",null,{"$error":"#VALUE!"},{"$error":"#VALUE!"},""]
[null,null,null,null,null,null,null,null,null,null,null,null,null,null,null,null,null,null,"",null,null,null,null,null,null,null,null,null,"",null,null,null,null,null,null,null,null,null,null,null,null,null,"","","","","Sit de Réf",null,{"$error":"#VALUE!"},{"$error":"#VALUE!"},""]
[null,null,null,null,null,null,null,null,null,null,null,null,null,null,null,null,null,null,"",null,null,null,null,null,null,null,null,null,"",null,null,null,null,null,null,null,null,null,null,null,null,null,"","","","","Sit de Réf",null,{"$error":"#VALUE!"},{"$error":"#VALUE!"},"",{"$f":"$AZ$9","v":"Moteur "},{"$f":"$BA$9","v":"Non moteur"},{"$f":"$BB$9","v":"Quel enjeu ?"},{"$f":"$BC$9","v":""},{"$f":"$BD$9","v":""},{"$f":"$BE$9","v":""},{"$f":"$BF$9","v":""},{"$f":"$BG$9","v":""}]
[null,null,null,null,null,null,null,null,null,null,null,null,null,null,null,null,null,null,"",null,null,null,null,null,null,null,null,null,"",null,null,null,null,null,null,null,null,null,null,null,null,null,"","","","","Sit de Réf",null,{"$error":"#VALUE!"},{"$error":"#VALUE!"},"",{"$f":"IF(Réglages!$B$12=\"\",\"\",\"Sit de Réf :  \"&Réglages!$B$12)","v":"Sit de Réf :  Le sablier"},{"$f":"IF(Réglages!$C$12=\"\",\"\",\"Sit de Réf :  \"&Réglages!$C$12)","v":""},{"$f":"IF(Réglages!$D$12=\"\",\"\",\"Sit de Réf :  \"&Réglages!$D$12)","v":""},{"$f":"IF(Réglages!$E$12=\"\",\"\",\"Sit de Réf :  \"&Réglages!$E$12)","v":""},{"$f":"IF(Réglages!$F$12=\"\",\"\",\"Sit de Réf :  \"&Réglages!$F$12)","v":""},{"$f":"IF(Réglages!$G$12=\"\",\"\",\"Sit de Réf :  \"&Réglages!$G$12)","v":""},{"$f":"IF(Réglages!$H$12=\"\",\"\",\"Sit de Réf :  \"&Réglages!$H$12)","v":""},{"$f":"IF(Réglages!$I$12=\"\",\"\",\"Sit de Réf :  \"&Réglages!$I$12)","v":""}]
[null,null,null,null,null,null,null,null,null,null,null,null,null,null,null,null,null,null,{"$f":"Réglages!$F$53","v":"Enjeu de travail principal de cette leçon >"},null,null,null,null,null,"",null,null,null,null,null,null,null,{"$f":"IF(Y195=\"\",\"\",IF(Y195=$AZ$39,$AZ$34,IF(Y195=$BA$39,$BA$34,IF(Y195=$BB$39,$BB$34,IF(Y195=$BC$39,$BC$34,IF(Y195=$BD$39,$BD$34,IF(Y195=$BE$39,$BE$34,IF(Y195=$BF$39,$BF$34,$BG$34))))))))","v":""},null,{"$f":"Réglages!$H$50","v":"Critères rappel >"},null,"C2 fggzev",null,{"$f":"Réglages!$H$51","v":"Je me situe >"},null,null,null,{"$f":"IF(AK195=\"\",\"\",ISNUMBER(MATCH(AK195,IF(AT195=1,$AZ$35:$AZ$38,IF(AT195=2,$BA$35:$BA$38,IF(AT195=3,$BB$35:$BB$38,IF(AT195=4,$BC$35:$BC$38,IF(AT195=5,$BD$35:$BD$38,IF(AW$5=6,$BE$35:$BE$38,IF(AT195=7,$BF$35:$BF$38,IF(AT195=8,$BG$35:$BG$38,1)))))))),0)))","v":false},"droite axe !!!!",{"$f":"IF(Y195=\"\",\"\",INDEX($AZ$10:$BG$10,MATCH(Y195,$AZ$8:$BG$8,0)))","v":""},{"$f":"VALUE(RIGHT(AS195,1))","v":{"$error":"#VALUE!"}},null,null,null,null,"c1",{"$f":"IF(Réglages!$B$14=\"\",\"\",\"C1 \"&Réglages!$B$14)","v":"C1 9 points"},{"$f":"IF(Réglages!$C$14=\"\",\"\",\"C1 \"&Réglages!$C$14)","v":""},{"$f":"IF(Réglages!$D$14=\"\",\"\",\"C1 \"&Réglages!$D$14)","v":""},{"$f":"IF(Réglages!$E$14=\"\",\"\",\"C1 \"&Réglages!$E$14)","v":""},{"$f":"IF(Réglages!$F$14=\"\",\"\",\"C1 \"&Réglages!$F$14)","v":""},{"$f":"IF(Réglages!$G$14=\"\",\"\",\"C1 \"&Réglages!$G$14)","v":""},{"$f":"IF(Réglages!$H$14=\"\",\"\",\"C1 \"&Réglages!$H$14)","v":""},{"$f":"IF(Réglages!$I$14=\"\",\"\",\"C1 \"&Réglages!$I$14)","v":""}]
[null,null,null,null,null,null,null,null,null,null,null,null,null,null,null,null,null,null,{"$f":"Réglages!$F$54","v":"Enjeu de travail secondaire de cette leçon >"},null,null,null,null,null,"",null,null,null,null,null,null,null,{"$f":"IF(Y196=\"\",\"\",IF(Y196=$AZ$40,$AZ$35,IF(Y196=$BA$40,$BA$35,IF(Y196=$BB$40,$BB$35,IF(Y196=$BC$40,$BC$35,IF(Y196=$BD$40,$BD$35,IF(Y196=$BE$40,$BE$35,IF(Y196=$BF$40,$BF$35,$BG$35))))))))","v":""},null,{"$f":"Réglages!$H$50","v":"Critères rappel >"},null,"C1 j",null,{"$f":"Réglages!$H$51","v":"Je me situe >"},null,null,null,{"$f":"IF(AK196=\"\",\"\",ISNUMBER(MATCH(AK196,IF(AT196=1,$AZ$35:$AZ$38,IF(AT196=2,$BA$35:$BA$38,IF(AT196=3,$BB$35:$BB$38,IF(AT196=4,$BC$35:$BC$38,IF(AT196=5,$BD$35:$BD$38,IF(AW$5=6,$BE$35:$BE$38,IF(AT196=7,$BF$35:$BF$38,IF(AT196=8,$BG$35:$BG$38,1)))))))),0)))","v":false},null,{"$f":"IF(Y196=\"\",\"\",INDEX($AZ$10:$BG$10,MATCH(Y196,$AZ$8:$BG$8,0)))","v":""},{"$f":"VALUE(RIGHT(AS196,1))","v":{"$error":"#VALUE!"}},null,"SI(AE35=AZ39;AZ35:AZ38;SI(AE35=BA39;BA35:BA38;SI(AE35=Bb39;Bb35:Bb38;SI(AE35=Bc39;Bc35:Bc38;SI(AE35=Bd39;Bd35:Bd38;SI(AE35=Be39;Be35:Be38;SI(AE35=Bf39;Bf35:Bf38;SI(AE35=Bg39;Bg35:Bg38;AY35:AY38))))))))",null,null,"c2",{"$f":"IF(Réglages!$B$15=\"\",\"\",\"C2 \"&Réglages!$B$15)","v":"C2 99 points"},{"$f":"IF(Réglages!$C$15=\"\",\"\",\"C2 \"&Réglages!$C$15)","v":""},{"$f":"IF(Réglages!$D$15=\"\",\"\",\"C2 \"&Réglages!$D$15)","v":""},{"$f":"IF(Réglages!$E$15=\"\",\"\",\"C2 \"&Réglages!$E$15)","v":""},{"$f":"IF(Réglages!$F$15=\"\",\"\",\"C2 \"&Réglages!$F$15)","v":""},{"$f":"IF(Réglages!$G$15=\"\",\"\",\"C2 \"&Réglages!$G$15)","v":""},{"$f":"IF(Réglages!$H$15=\"\",\"\",\"C2 \"&Réglages!$H$15)","v":""},{"$f":"IF(Réglages!$I$15=\"\",\"\",\"C2 \"&Réglages!$I$15)","v":""}]
[null,null,null,null,null,null,null,null,null,null,null,null,null,null,null,null,null,null,{"$f":" Réglages!$H$52&AR183&\" >\"","v":"Mon Projet pour L10 >"},null,null,null,null,null,null,null,null,null,null,null,null,null,null,null,null,null,null,null,{"$f":"Réglages!$H$53&AR183&\" >\"","v":"Mon Axe Pioritaire en L10 >"},null,null,null,null,null,null,null,null,null,null,null,"c3",{"$f":"IF(Réglages!$B$16=\"\",\"\",\"C3 \"&Réglages!$B$16)","v":"C3 999 pts "},{"$f":"IF(Réglages!$C$16=\"\",\"\",\"C3 \"&Réglages!$C$16)","v":""},{"$f":"IF(Réglages!$D$16=\"\",\"\",\"C3 \"&Réglages!$D$16)","v":""},{"$f":"IF(Réglages!$E$16=\"\",\"\",\"C3 \"&Réglages!$E$16)","v":""},{"$f":"IF(Réglages!$F$16=\"\",\"\",\"C3 \"&Réglages!$F$16)","v":""},{"$f":"IF(Réglages!$G$16=\"\",\"\",\"C3 \"&Réglages!$G$16)","v":""},{"$f":"IF(Réglages!$H$16=\"\",\"\",\"C3 \"&Réglages!$H$16)","v":""},{"$f":"IF(Réglages!$I$16=\"\",\"\",\"C3 \"&Réglages!$I$16)","v":""}]
[null,null,null,null,null,null,null,null,null,null,null,null,null,null,null,null,null,null,null,null,null,null,null,null,null,null,null,null,null,null,null,null,null,null,null,null,null,null,null,null,null,null,null,null,null,null,null,null,null,null,"c4",{"$f":"IF(Réglages!$B$17=\"\",\"\",\"C4 \"&Réglages!$B$17)","v":"C4 9999 pts"},{"$f":"IF(Réglages!$C$17=\"\",\"\",\"C4 \"&Réglages!$C$17)","v":""},{"$f":"IF(Réglages!$D$17=\"\",\"\",\"C4 \"&Réglages!$D$17)","v":""},{"$f":"IF(Réglages!$E$17=\"\",\"\",\"C4 \"&Réglages!$E$17)","v":""},{"$f":"IF(Réglages!$F$17=\"\",\"\",\"C4 \"&Réglages!$F$17)","v":""},{"$f":"IF(Réglages!$G$17=\"\",\"\",\"C4 \"&Réglages!$G$17)","v":""},{"$f":"IF(Réglages!$H$17=\"\",\"\",\"C4 \"&Réglages!$H$17)","v":""},{"$f":"IF(Réglages!$I$17=\"\",\"\",\"C4 \"&Réglages!$I$17)","v":""}]
[null,null,null,null,null,null,null,null,null,null,null,null,null,null,null,null,null,null,null,null,null,null,null,null,null,null,null,null,null,null,null,null,null,null,null,null,null,null,null,null,null,null,null,null,null,null,null,null,null,null,{"$f":"Réglages!$L$5","v":"Moteur "},{"$f":"IF($AZ$8=\"\",\"\",$AZ$8)","v":"Le serveur "},{"$f":"IF($BA$8=\"\",\"\",$BA$8)","v":"Observateur"},{"$f":"IF($BB$8=\"\",\"\",$BB$8)","v":"?"},{"$f":"IF($BC$8=\"\",\"\",$BC$8)","v":""},{"$f":"IF($BD$8=\"\",\"\",$BD$8)","v":""},{"$f":"IF($BE$8=\"\",\"\",$BE$8)","v":""},{"$f":"IF($BF$8=\"\",\"\",$BF$8)","v":""},{"$f":"IF($BG$8=\"\",\"\",$BG$8)","v":""}]
[null,null,null,null,null,null,null,null,null,null,null,null,null,null,null,null,null,null,null,null,null,null,null,null,null,null,null,null,null,null,null,null,null,null,null,null,null,null,null,null,null,null,null,null,null,null,null,null,null,null,{"$f":"Réglages!$L$6","v":"Non moteur"},{"$f":"IF($AZ$8=\"\",\"\",$AZ$8)","v":"Le serveur "},{"$f":"IF($BA$8=\"\",\"\",$BA$8)","v":"Observateur"},{"$f":"IF($BB$8=\"\",\"\",$BB$8)","v":"?"},{"$f":"IF($BC$8=\"\",\"\",$BC$8)","v":""},{"$f":"IF($BD$8=\"\",\"\",$BD$8)","v":""},{"$f":"IF($BE$8=\"\",\"\",$BE$8)","v":""},{"$f":"IF($BF$8=\"\",\"\",$BF$8)","v":""},{"$f":"IF($BG$8=\"\",\"\",$BG$8)","v":""}]
[]
[]
[null,null,null,null,null,null,null,null,null,null,null,null,null,null,null,null,null,"Leçon 10",null,null,null,null,null,null,null,null,null,null,null,null,null,null,null,null,null,null,null,null,null,null,null,null,null,{"$f":"RIGHT(R203,1)+1","v":1},{"$f":"MATCH(AG205,IF(AW205=1,AZ192:AZ201,IF(AW205=2,BA192:BA201,1)),0)","v":{"$error":"#VALUE!"}},{"$f":"OR(AND(AW205=1,MATCH(AG205,AZ192:AZ201,0)),(AND(AW205=2,MATCH(AG205,BA192:BA201,0))))","v":{"$error":"#VALUE!"}}]
[null,null,null,null,null,null,null,null,null,null,null,null,null,null,null,null,null,null,{"$f":"Réglages!$D$54","v":"Axes de Travail "},null,null,null,null,null,null,null,null,null,null,null,null,null,{"$f":"Réglages!$F$50","v":"Situations d'apprentissage"},null,null,null,{"$f":"Réglages!$F$51","v":"Résultats "},null,{"$f":"Réglages!$F$52","v":"Je me projette"},null,null,null,null,-1,0,1,"réf",null,"n colonne","n ligne "]
[null,null,null,null,null,null,null,null,null,null,null,null,null,null,null,null,null,null,"",null,null,null,null,null,null,null,null,null,{"$f":"IF(S205=\"\",\"\",INDEX($AZ$10:$BG$10,MATCH(S205,$AZ$8:$BG$8,0)))","v":""},null,null,null,null,null,null,null,null,null,"3/ sit3",null,null,null,{"$f":"IF(AG205=\"\",\"\",ISNUMBER(MATCH(AG205,IF(AW205=1,$AZ$12:$AZ$26,IF(AW205=2,$BA$12:$BA$26,IF(AW205=3,$BB$12:$BB$26,IF(AW205=4,$BC$12:$BC$26,IF(AW205=5,$BD$12:$BD$26,IF(AW$5=6,$BE$12:$BE$26,IF(AW205=7,$BF$12:$BF$26,IF(AW205=8,$BG$12:$BG$26,1)))))))),0)))","v":""},{"$f":"IFERROR(INDEX($AZ$12:$BG$26,AX205-1,AW205),\"\")","v":""},{"$f":"IFERROR(INDEX($AZ$12:$BG$26,AX205,AW205),\"\")","v":""},{"$f":"IFERROR(INDEX($AZ$12:$BG$26,AX205+1,AW205),\"\")","v":""},"Sit de Réf",null,{"$f":"VALUE(RIGHT(AC205,1))","v":{"$error":"#VALUE!"}},{"$f":"VALUE(LEFT(AG205,2))","v":{"$error":"#VALUE!"}},{"$f":"IF(AM205=\"\",\"\",IF(AM205=AU205,AU205,ISNUMBER(MATCH(AM205,IF(AW205=1,$AZ$12:$AZ$26,IF(AW205=2,$BA$12:$BA$26,IF(AW205=3,$BB$12:$BB$26,IF(AW205=4,$BC$12:$BC$26,IF(AW205=5,$BD$12:$BD$26,IF(AW$5=6,$BE$12:$BE$26,IF(AW205=7,$BF$12:$BF$26,IF(AW205=8,$BG$12:$BG$26,1)))))))),0))))","v":false}]
[null,null,null,null,null,null,null,null,null,null,null,null,null,null,null,null,null,null,"",null,null,null,null,null,null,null,null,null,"",null,null,null,null,null,null,null,null,null,null,null,null,null,{"$f":"IF(AG206=\"\",\"\",ISNUMBER(MATCH(AG206,IF(AW206=1,$AZ$12:$AZ$26,IF(AW206=2,$BA$12:$BA$26,IF(AW206=3,$BB$12:$BB$26,IF(AW206=4,$BC$12:$BC$26,IF(AW206=5,$BD$12:$BD$26,IF(AW$5=6,$BE$12:$BE$26,IF(AW206=7,$BF$12:$BF$26,IF(AW206=8,$BG$12:$BG$26,1)))))))),0)))","v":""},{"$f":"IFERROR(INDEX($AZ$12:$BG$26,AX206-1,AW206),\"\")","v":""},{"$f":"IFERROR(INDEX($AZ$12:$BG$26,AX206,AW206),\"\")","v":""},{"$f":"IFERROR(INDEX($AZ$12:$BG$26,AX206+1,AW206),\"\")","v":""},"Sit de Réf",null,{"$error":"#VALUE!"},{"$f":"VALUE(LEFT(AG206,2))","v":{"$error":"#VALUE!"}},{"$f":"IF(AM206=\"\",\"\",IF(AM206=AU206,AU206,ISNUMBER(MATCH(AM206,IF(AW206=1,$AZ$12:$AZ$26,IF(AW206=2,$BA$12:$BA$26,IF(AW206=3,$BB$12:$BB$26,IF(AW206=4,$BC$12:$BC$26,IF(AW206=5,$BD$12:$BD$26,IF(AW$5=6,$BE$12:$BE$26,IF(AW206=7,$BF$12:$BF$26,IF(AW206=8,$BG$12:$BG$26,1)))))))),0))))","v":""}]
[null,null,null,null,null,null,null,null,null,null,null,null,null,null,null,null,null,null,"",null,null,null,null,null,null,null,null,null,"",null,null,null,null,null,null,null,null,null,null,null,null,null,"","","","","Sit de Réf",null,{"$error":"#VALUE!"},{"$error":"#VALUE!"},""]
[null,null,null,null,null,null,null,null,null,null,null,null,null,null,null,null,null,null,"",null,null,null,null,null,null,null,null,null,"",null,null,null,null,null,null,null,null,null,null,null,null,null,"","","","","Sit de Réf",null,{"$error":"#VALUE!"},{"$error":"#VALUE!"},""]
[null,null,null,null,null,null,null,null,null,null,null,null,null,null,null,null,null,null,"",null,null,null,null,null,null,null,null,null,"",null,null,null,null,null,null,null,null,null,null,null,null,null,"","","","","Sit de Réf",null,{"$error":"#VALUE!"},{"$error":"#VALUE!"},""]
[null,null,null,null,null,null,null,null,null,null,null,null,null,null,null,null,null,null,"",null,null,null,null,null,null,null,null,null,"",null,null,null,null,null,null,null,null,null,"13/ i",null,null,null,"","","","","Sit de Réf",null,{"$error":"#VALUE!"},{"$error":"#VALUE!"},false]
[null,null,null,null,null,null,null,null,null,null,null,null,null,null,null,null,null,null,"",null,null,null,null,null,null,null,null,null,"",null,null,null,null,null,null,null,null,null,null,null,null,null,"","","","","Sit de Réf",null,{"$error":"#VALUE!"},{"$error":"#VALUE!"},""]
[null,null,null,null,null,null,null,null,null,null,null,null,null,null,null,null,null,null,"",null,null,null,null,null,null,null,null,null,"",null,null,null,null,null,null,null,null,null,null,null,null,null,"","","","","Sit de Réf",null,{"$error":"#VALUE!"},{"$error":"#VALUE!"},""]
[null,null,null,null,null,null,null,null,null,null,null,null,null,null,null,null,null,null,"",null,null,null,null,null,null,null,null,null,"",null,null,null,null,null,null,null,null,null,null,null,null,null,"","","","","Sit de Réf",null,{"$error":"#VALUE!"},{"$error":"#VALUE!"},"",{"$f":"$AZ$9","v":"Moteur "},{"$f":"$BA$9","v":"Non moteur"},{"$f":"$BB$9","v":"Quel enjeu ?"},{"$f":"$BC$9","v":""},{"$f":"$BD$9","v":""},{"$f":"$BE$9","v":""},{"$f":"$BF$9","v":""},{"$f":"$BG$9","v":""}]
[null,null,null,null,null,null,null,null,null,null,null,null,null,null,null,null,null,null,"",null,null,null,null,null,null,null,null,null,"",null,null,null,null,null,null,null,null,null,null,null,null,null,"","","","","Sit de Réf",null,{"$error":"#VALUE!"},{"$error":"#VALUE!"},"",{"$f":"IF(Réglages!$B$12=\"\",\"\",\"Sit de Réf :  \"&Réglages!$B$12)","v":"Sit de Réf :  Le sablier"},{"$f":"IF(Réglages!$C$12=\"\",\"\",\"Sit de Réf :  \"&Réglages!$C$12)","v":""},{"$f":"IF(Réglages!$D$12=\"\",\"\",\"Sit de Réf :  \"&Réglages!$D$12)","v":""},{"$f":"IF(Réglages!$E$12=\"\",\"\",\"Sit de Réf :  \"&Réglages!$E$12)","v":""},{"$f":"IF(Réglages!$F$12=\"\",\"\",\"Sit de Réf :  \"&Réglages!$F$12)","v":""},{"$f":"IF(Réglages!$G$12=\"\",\"\",\"Sit de Réf :  \"&Réglages!$G$12)","v":""},{"$f":"IF(Réglages!$H$12=\"\",\"\",\"Sit de Réf :  \"&Réglages!$H$12)","v":""},{"$f":"IF(Réglages!$I$12=\"\",\"\",\"Sit de Réf :  \"&Réglages!$I$12)","v":""}]
[null,null,null,null,null,null,null,null,null,null,null,null,null,null,null,null,null,null,{"$f":"Réglages!$F$53","v":"Enjeu de travail principal de cette leçon >"},null,null,null,null,null,"",null,null,null,null,null,null,null,{"$f":"IF(Y215=\"\",\"\",IF(Y215=$AZ$39,$AZ$34,IF(Y215=$BA$39,$BA$34,IF(Y215=$BB$39,$BB$34,IF(Y215=$BC$39,$BC$34,IF(Y215=$BD$39,$BD$34,IF(Y215=$BE$39,$BE$34,IF(Y215=$BF$39,$BF$34,$BG$34))))))))","v":""},null,{"$f":"Réglages!$H$50","v":"Critères rappel >"},null,"C2 fggzev",null,{"$f":"Réglages!$H$51","v":"Je me situe >"},null,null,null,{"$f":"IF(AK215=\"\",\"\",ISNUMBER(MATCH(AK215,IF(AT215=1,$AZ$35:$AZ$38,IF(AT215=2,$BA$35:$BA$38,IF(AT215=3,$BB$35:$BB$38,IF(AT215=4,$BC$35:$BC$38,IF(AT215=5,$BD$35:$BD$38,IF(AW$5=6,$BE$35:$BE$38,IF(AT215=7,$BF$35:$BF$38,IF(AT215=8,$BG$35:$BG$38,1)))))))),0)))","v":false},"droite axe !!!!",{"$f":"IF(Y215=\"\",\"\",INDEX($AZ$10:$BG$10,MATCH(Y215,$AZ$8:$BG$8,0)))","v":""},{"$f":"VALUE(RIGHT(AS215,1))","v":{"$error":"#VALUE!"}},null,null,null,null,"c1",{"$f":"IF(Réglages!$B$14=\"\",\"\",\"C1 \"&Réglages!$B$14)","v":"C1 9 points"},{"$f":"IF(Réglages!$C$14=\"\",\"\",\"C1 \"&Réglages!$C$14)","v":""},{"$f":"IF(Réglages!$D$14=\"\",\"\",\"C1 \"&Réglages!$D$14)","v":""},{"$f":"IF(Réglages!$E$14=\"\",\"\",\"C1 \"&Réglages!$E$14)","v":""},{"$f":"IF(Réglages!$F$14=\"\",\"\",\"C1 \"&Réglages!$F$14)","v":""},{"$f":"IF(Réglages!$G$14=\"\",\"\",\"C1 \"&Réglages!$G$14)","v":""},{"$f":"IF(Réglages!$H$14=\"\",\"\",\"C1 \"&Réglages!$H$14)","v":""},{"$f":"IF(Réglages!$I$14=\"\",\"\",\"C1 \"&Réglages!$I$14)","v":""}]
[null,null,null,null,null,null,null,null,null,null,null,null,null,null,null,null,null,null,{"$f":"Réglages!$F$54","v":"Enjeu de travail secondaire de cette leçon >"},null,null,null,null,null,"",null,null,null,null,null,null,null,{"$f":"IF(Y216=\"\",\"\",IF(Y216=$AZ$40,$AZ$35,IF(Y216=$BA$40,$BA$35,IF(Y216=$BB$40,$BB$35,IF(Y216=$BC$40,$BC$35,IF(Y216=$BD$40,$BD$35,IF(Y216=$BE$40,$BE$35,IF(Y216=$BF$40,$BF$35,$BG$35))))))))","v":""},null,{"$f":"Réglages!$H$50","v":"Critères rappel >"},null,"C1 j",null,{"$f":"Réglages!$H$51","v":"Je me situe >"},null,null,null,{"$f":"IF(AK216=\"\",\"\",ISNUMBER(MATCH(AK216,IF(AT216=1,$AZ$35:$AZ$38,IF(AT216=2,$BA$35:$BA$38,IF(AT216=3,$BB$35:$BB$38,IF(AT216=4,$BC$35:$BC$38,IF(AT216=5,$BD$35:$BD$38,IF(AW$5=6,$BE$35:$BE$38,IF(AT216=7,$BF$35:$BF$38,IF(AT216=8,$BG$35:$BG$38,1)))))))),0)))","v":false},null,{"$f":"IF(Y216=\"\",\"\",INDEX($AZ$10:$BG$10,MATCH(Y216,$AZ$8:$BG$8,0)))","v":""},{"$f":"VALUE(RIGHT(AS216,1))","v":{"$error":"#VALUE!"}},null,"SI(AE35=AZ39;AZ35:AZ38;SI(AE35=BA39;BA35:BA38;SI(AE35=Bb39;Bb35:Bb38;SI(AE35=Bc39;Bc35:Bc38;SI(AE35=Bd39;Bd35:Bd38;SI(AE35=Be39;Be35:Be38;SI(AE35=Bf39;Bf35:Bf38;SI(AE35=Bg39;Bg35:Bg38;AY35:AY38))))))))",null,null,"c2",{"$f":"IF(Réglages!$B$15=\"\",\"\",\"C2 \"&Réglages!$B$15)","v":"C2 99 points"},{"$f":"IF(Réglages!$C$15=\"\",\"\",\"C2 \"&Réglages!$C$15)","v":""},{"$f":"IF(Réglages!$D$15=\"\",\"\",\"C2 \"&Réglages!$D$15)","v":""},{"$f":"IF(Réglages!$E$15=\"\",\"\",\"C2 \"&Réglages!$E$15)","v":""},{"$f":"IF(Réglages!$F$15=\"\",\"\",\"C2 \"&Réglages!$F$15)","v":""},{"$f":"IF(Réglages!$G$15=\"\",\"\",\"C2 \"&Réglages!$G$15)","v":""},{"$f":"IF(Réglages!$H$15=\"\",\"\",\"C2 \"&Réglages!$H$15)","v":""},{"$f":"IF(Réglages!$I$15=\"\",\"\",\"C2 \"&Réglages!$I$15)","v":""}]
[null,null,null,null,null,null,null,null,null,null,null,null,null,null,null,null,null,null,{"$f":" Réglages!$H$52&AR203&\" >\"","v":"Mon Projet pour L1 >"},null,null,null,null,null,null,null,null,null,null,null,null,null,null,null,null,null,null,null,{"$f":"Réglages!$H$53&AR203&\" >\"","v":"Mon Axe Pioritaire en L1 >"},null,null,null,null,null,null,null,null,null,null,null,"c3",{"$f":"IF(Réglages!$B$16=\"\",\"\",\"C3 \"&Réglages!$B$16)","v":"C3 999 pts "},{"$f":"IF(Réglages!$C$16=\"\",\"\",\"C3 \"&Réglages!$C$16)","v":""},{"$f":"IF(Réglages!$D$16=\"\",\"\",\"C3 \"&Réglages!$D$16)","v":""},{"$f":"IF(Réglages!$E$16=\"\",\"\",\"C3 \"&Réglages!$E$16)","v":""},{"$f":"IF(Réglages!$F$16=\"\",\"\",\"C3 \"&Réglages!$F$16)","v":""},{"$f":"IF(Réglages!$G$16=\"\",\"\",\"C3 \"&Réglages!$G$16)","v":""},{"$f":"IF(Réglages!$H$16=\"\",\"\",\"C3 \"&Réglages!$H$16)","v":""},{"$f":"IF(Réglages!$I$16=\"\",\"\",\"C3 \"&Réglages!$I$16)","v":""}]
[null,null,null,null,null,null,null,null,null,null,null,null,null,null,null,null,null,null,null,null,null,null,null,null,null,null,null,null,null,null,null,null,null,null,null,null,null,null,null,null,null,null,null,null,null,null,null,null,null,null,"c4",{"$f":"IF(Réglages!$B$17=\"\",\"\",\"C4 \"&Réglages!$B$17)","v":"C4 9999 pts"},{"$f":"IF(Réglages!$C$17=\"\",\"\",\"C4 \"&Réglages!$C$17)","v":""},{"$f":"IF(Réglages!$D$17=\"\",\"\",\"C4 \"&Réglages!$D$17)","v":""},{"$f":"IF(Réglages!$E$17=\"\",\"\",\"C4 \"&Réglages!$E$17)","v":""},{"$f":"IF(Réglages!$F$17=\"\",\"\",\"C4 \"&Réglages!$F$17)","v":""},{"$f":"IF(Réglages!$G$17=\"\",\"\",\"C4 \"&Réglages!$G$17)","v":""},{"$f":"IF(Réglages!$H$17=\"\",\"\",\"C4 \"&Réglages!$H$17)","v":""},{"$f":"IF(Réglages!$I$17=\"\",\"\",\"C4 \"&Réglages!$I$17)","v":""}]
[null,null,null,null,null,null,null,null,null,null,null,null,null,null,null,null,null,null,null,null,null,null,null,null,null,null,null,null,null,null,null,null,null,null,null,null,null,null,null,null,null,null,null,null,null,null,null,null,null,null,{"$f":"Réglages!$L$5","v":"Moteur "},{"$f":"IF($AZ$8=\"\",\"\",$AZ$8)","v":"Le serveur "},{"$f":"IF($BA$8=\"\",\"\",$BA$8)","v":"Observateur"},{"$f":"IF($BB$8=\"\",\"\",$BB$8)","v":"?"},{"$f":"IF($BC$8=\"\",\"\",$BC$8)","v":""},{"$f":"IF($BD$8=\"\",\"\",$BD$8)","v":""},{"$f":"IF($BE$8=\"\",\"\",$BE$8)","v":""},{"$f":"IF($BF$8=\"\",\"\",$BF$8)","v":""},{"$f":"IF($BG$8=\"\",\"\",$BG$8)","v":""}]
[null,null,null,null,null,null,null,null,null,null,null,null,null,null,null,null,null,null,null,null,null,null,null,null,null,null,null,null,null,null,null,null,null,null,null,null,null,null,null,null,null,null,null,null,null,null,null,null,null,null,{"$f":"Réglages!$L$6","v":"Non moteur"},{"$f":"IF($AZ$8=\"\",\"\",$AZ$8)","v":"Le serveur "},{"$f":"IF($BA$8=\"\",\"\",$BA$8)","v":"Observateur"},{"$f":"IF($BB$8=\"\",\"\",$BB$8)","v":"?"},{"$f":"IF($BC$8=\"\",\"\",$BC$8)","v":""},{"$f":"IF($BD$8=\"\",\"\",$BD$8)","v":""},{"$f":"IF($BE$8=\"\",\"\",$BE$8)","v":""},{"$f":"IF($BF$8=\"\",\"\",$BF$8)","v":""},{"$f":"IF($BG$8=\"\",\"\",$BG$8)","v":""}]
[]
[]
[null,null,null,null,null,null,null,null,null,null,null,null,null,null,null,null,null,"Leçon 11",null,null,null,null,null,null,null,null,null,null,null,null,null,null,null,null,null,null,null,null,null,null,null,null,null,{"$f":"RIGHT(R223,1)+1","v":2},{"$f":"MATCH(AG225,IF(AW225=1,AZ212:AZ221,IF(AW225=2,BA212:BA221,1)),0)","v":{"$error":"#VALUE!"}},{"$f":"OR(AND(AW225=1,MATCH(AG225,AZ212:AZ221,0)),(AND(AW225=2,MATCH(AG225,BA212:BA221,0))))","v":{"$error":"#VALUE!"}}]
[null,null,null,null,null,null,null,null,null,null,null,null,null,null,null,null,null,null,{"$f":"Réglages!$D$54","v":"Axes de Travail "},null,null,null,null,null,null,null,null,null,null,null,null,null,{"$f":"Réglages!$F$50","v":"Situations d'apprentissage"},null,null,null,{"$f":"Réglages!$F$51","v":"Résultats "},null,{"$f":"Réglages!$F$52","v":"Je me projette"},null,null,null,null,-1,0,1,"réf",null,"n colonne","n ligne "]
[null,null,null,null,null,null,null,null,null,null,null,null,null,null,null,null,null,null,"",null,null,null,null,null,null,null,null,null,{"$f":"IF(S225=\"\",\"\",INDEX($AZ$10:$BG$10,MATCH(S225,$AZ$8:$BG$8,0)))","v":""},null,null,null,null,null,null,null,null,null,"3/ sit3",null,null,null,{"$f":"IF(AG225=\"\",\"\",ISNUMBER(MATCH(AG225,IF(AW225=1,$AZ$12:$AZ$26,IF(AW225=2,$BA$12:$BA$26,IF(AW225=3,$BB$12:$BB$26,IF(AW225=4,$BC$12:$BC$26,IF(AW225=5,$BD$12:$BD$26,IF(AW$5=6,$BE$12:$BE$26,IF(AW225=7,$BF$12:$BF$26,IF(AW225=8,$BG$12:$BG$26,1)))))))),0)))","v":""},{"$f":"IFERROR(INDEX($AZ$12:$BG$26,AX225-1,AW225),\"\")","v":""},{"$f":"IFERROR(INDEX($AZ$12:$BG$26,AX225,AW225),\"\")","v":""},{"$f":"IFERROR(INDEX($AZ$12:$BG$26,AX225+1,AW225),\"\")","v":""},"Sit de Réf",null,{"$f":"VALUE(RIGHT(AC225,1))","v":{"$error":"#VALUE!"}},{"$f":"VALUE(LEFT(AG225,2))","v":{"$error":"#VALUE!"}},{"$f":"IF(AM225=\"\",\"\",IF(AM225=AU225,AU225,ISNUMBER(MATCH(AM225,IF(AW225=1,$AZ$12:$AZ$26,IF(AW225=2,$BA$12:$BA$26,IF(AW225=3,$BB$12:$BB$26,IF(AW225=4,$BC$12:$BC$26,IF(AW225=5,$BD$12:$BD$26,IF(AW$5=6,$BE$12:$BE$26,IF(AW225=7,$BF$12:$BF$26,IF(AW225=8,$BG$12:$BG$26,1)))))))),0))))","v":false}]
[null,null,null,null,null,null,null,null,null,null,null,null,null,null,null,null,null,null,"",null,null,null,null,null,null,null,null,null,"",null,null,null,null,null,null,null,null,null,null,null,null,null,{"$f":"IF(AG226=\"\",\"\",ISNUMBER(MATCH(AG226,IF(AW226=1,$AZ$12:$AZ$26,IF(AW226=2,$BA$12:$BA$26,IF(AW226=3,$BB$12:$BB$26,IF(AW226=4,$BC$12:$BC$26,IF(AW226=5,$BD$12:$BD$26,IF(AW$5=6,$BE$12:$BE$26,IF(AW226=7,$BF$12:$BF$26,IF(AW226=8,$BG$12:$BG$26,1)))))))),0)))","v":""},{"$f":"IFERROR(INDEX($AZ$12:$BG$26,AX226-1,AW226),\"\")","v":""},{"$f":"IFERROR(INDEX($AZ$12:$BG$26,AX226,AW226),\"\")","v":""},{"$f":"IFERROR(INDEX($AZ$12:$BG$26,AX226+1,AW226),\"\")","v":""},"Sit de Réf",null,{"$error":"#VALUE!"},{"$f":"VALUE(LEFT(AG226,2))","v":{"$error":"#VALUE!"}},{"$f":"IF(AM226=\"\",\"\",IF(AM226=AU226,AU226,ISNUMBER(MATCH(AM226,IF(AW226=1,$AZ$12:$AZ$26,IF(AW226=2,$BA$12:$BA$26,IF(AW226=3,$BB$12:$BB$26,IF(AW226=4,$BC$12:$BC$26,IF(AW226=5,$BD$12:$BD$26,IF(AW$5=6,$BE$12:$BE$26,IF(AW226=7,$BF$12:$BF$26,IF(AW226=8,$BG$12:$BG$26,1)))))))),0))))","v":""}]
[null,null,null,null,null,null,null,null,null,null,null,null,null,null,null,null,null,null,"",null,null,null,null,null,null,null,null,null,"",null,null,null,null,null,null,null,null,null,null,null,null,null,"","","","","Sit de Réf",null,{"$error":"#VALUE!"},{"$error":"#VALUE!"},""]
[null,null,null,null,null,null,null,null,null,null,null,null,null,null,null,null,null,null,"",null,null,null,null,null,null,null,null,null,"",null,null,null,null,null,null,null,null,null,null,null,null,null,"","","","","Sit de Réf",null,{"$error":"#VALUE!"},{"$error":"#VALUE!"},""]
[null,null,null,null,null,null,null,null,null,null,null,null,null,null,null,null,null,null,"",null,null,null,null,null,null,null,null,null,"",null,null,null,null,null,null,null,null,null,null,null,null,null,"","","","","Sit de Réf",null,{"$error":"#VALUE!"},{"$error":"#VALUE!"},""]
[null,null,null,null,null,null,null,null,null,null,null,null,null,null,null,null,null,null,"",null,null,null,null,null,null,null,null,null,"",null,null,null,null,null,null,null,null,null,null,null,null,null,"","","","","Sit de Réf",null,{"$error":"#VALUE!"},{"$error":"#VALUE!"},""]
[null,null,null,null,null,null,null,null,null,null,null,null,null,null,null,null,null,null,"",null,null,null,null,null,null,null,null,null,"",null,null,null,null,null,null,null,null,null,null,null,null,null,"","","","","Sit de Réf",null,{"$error":"#VALUE!"},{"$error":"#VALUE!"},""]
[null,null,null,null,null,null,null,null,null,null,null,null,null,null,null,null,null,null,"",null,null,null,null,null,null,null,null,null,"",null,null,null,null,null,null,null,null,null,null,null,null,null,"","","","","Sit de Réf",null,{"$error":"#VALUE!"},{"$error":"#VALUE!"},""]
[null,null,null,null,null,null,null,null,null,null,null,null,null,null,null,null,null,null,"",null,null,null,null,null,null,null,null,null,"",null,null,null,null,null,null,null,null,null,null,null,null,null,"","","","","Sit de Réf",null,{"$error":"#VALUE!"},{"$error":"#VALUE!"},"",{"$f":"$AZ$9","v":"Moteur "},{"$f":"$BA$9","v":"Non moteur"},{"$f":"$BB$9","v":"Quel enjeu ?"},{"$f":"$BC$9","v":""},{"$f":"$BD$9","v":""},{"$f":"$BE$9","v":""},{"$f":"$BF$9","v":""},{"$f":"$BG$9","v":""}]
[null,null,null,null,null,null,null,null,null,null,null,null,null,null,null,null,null,null,"",null,null,null,null,null,null,null,null,null,"",null,null,null,null,null,null,null,null,null,null,null,null,null,"","","","","Sit de Réf",null,{"$error":"#VALUE!"},{"$error":"#VALUE!"},"",{"$f":"IF(Réglages!$B$12=\"\",\"\",\"Sit de Réf :  \"&Réglages!$B$12)","v":"Sit de Réf :  Le sablier"},{"$f":"IF(Réglages!$C$12=\"\",\"\",\"Sit de Réf :  \"&Réglages!$C$12)","v":""},{"$f":"IF(Réglages!$D$12=\"\",\"\",\"Sit de Réf :  \"&Réglages!$D$12)","v":""},{"$f":"IF(Réglages!$E$12=\"\",\"\",\"Sit de Réf :  \"&Réglages!$E$12)","v":""},{"$f":"IF(Réglages!$F$12=\"\",\"\",\"Sit de Réf :  \"&Réglages!$F$12)","v":""},{"$f":"IF(Réglages!$G$12=\"\",\"\",\"Sit de Réf :  \"&Réglages!$G$12)","v":""},{"$f":"IF(Réglages!$H$12=\"\",\"\",\"Sit de Réf :  \"&Réglages!$H$12)","v":""},{"$f":"IF(Réglages!$I$12=\"\",\"\",\"Sit de Réf :  \"&Réglages!$I$12)","v":""}]
[null,null,null,null,null,null,null,null,null,null,null,null,null,null,null,null,null,null,{"$f":"Réglages!$F$53","v":"Enjeu de travail principal de cette leçon >"},null,null,null,null,null,"",null,null,null,null,null,null,null,{"$f":"IF(Y235=\"\",\"\",IF(Y235=$AZ$39,$AZ$34,IF(Y235=$BA$39,$BA$34,IF(Y235=$BB$39,$BB$34,IF(Y235=$BC$39,$BC$34,IF(Y235=$BD$39,$BD$34,IF(Y235=$BE$39,$BE$34,IF(Y235=$BF$39,$BF$34,$BG$34))))))))","v":""},null,{"$f":"Réglages!$H$50","v":"Critères rappel >"},null,"C2 fggzev",null,{"$f":"Réglages!$H$51","v":"Je me situe >"},null,null,null,{"$f":"IF(AK235=\"\",\"\",ISNUMBER(MATCH(AK235,IF(AT235=1,$AZ$35:$AZ$38,IF(AT235=2,$BA$35:$BA$38,IF(AT235=3,$BB$35:$BB$38,IF(AT235=4,$BC$35:$BC$38,IF(AT235=5,$BD$35:$BD$38,IF(AW$5=6,$BE$35:$BE$38,IF(AT235=7,$BF$35:$BF$38,IF(AT235=8,$BG$35:$BG$38,1)))))))),0)))","v":false},"droite axe !!!!",{"$f":"IF(Y235=\"\",\"\",INDEX($AZ$10:$BG$10,MATCH(Y235,$AZ$8:$BG$8,0)))","v":""},{"$f":"VALUE(RIGHT(AS235,1))","v":{"$error":"#VALUE!"}},null,null,null,null,"c1",{"$f":"IF(Réglages!$B$14=\"\",\"\",\"C1 \"&Réglages!$B$14)","v":"C1 9 points"},{"$f":"IF(Réglages!$C$14=\"\",\"\",\"C1 \"&Réglages!$C$14)","v":""},{"$f":"IF(Réglages!$D$14=\"\",\"\",\"C1 \"&Réglages!$D$14)","v":""},{"$f":"IF(Réglages!$E$14=\"\",\"\",\"C1 \"&Réglages!$E$14)","v":""},{"$f":"IF(Réglages!$F$14=\"\",\"\",\"C1 \"&Réglages!$F$14)","v":""},{"$f":"IF(Réglages!$G$14=\"\",\"\",\"C1 \"&Réglages!$G$14)","v":""},{"$f":"IF(Réglages!$H$14=\"\",\"\",\"C1 \"&Réglages!$H$14)","v":""},{"$f":"IF(Réglages!$I$14=\"\",\"\",\"C1 \"&Réglages!$I$14)","v":""}]
[null,null,null,null,null,null,null,null,null,null,null,null,null,null,null,null,null,null,{"$f":"Réglages!$F$54","v":"Enjeu de travail secondaire de cette leçon >"},null,null,null,null,null,"",null,null,null,null,null,null,null,{"$f":"IF(Y236=\"\",\"\",IF(Y236=$AZ$40,$AZ$35,IF(Y236=$BA$40,$BA$35,IF(Y236=$BB$40,$BB$35,IF(Y236=$BC$40,$BC$35,IF(Y236=$BD$40,$BD$35,IF(Y236=$BE$40,$BE$35,IF(Y236=$BF$40,$BF$35,$BG$35))))))))","v":""},null,{"$f":"Réglages!$H$50","v":"Critères rappel >"},null,"C1 j",null,{"$f":"Réglages!$H$51","v":"Je me situe >"},null,null,null,{"$f":"IF(AK236=\"\",\"\",ISNUMBER(MATCH(AK236,IF(AT236=1,$AZ$35:$AZ$38,IF(AT236=2,$BA$35:$BA$38,IF(AT236=3,$BB$35:$BB$38,IF(AT236=4,$BC$35:$BC$38,IF(AT236=5,$BD$35:$BD$38,IF(AW$5=6,$BE$35:$BE$38,IF(AT236=7,$BF$35:$BF$38,IF(AT236=8,$BG$35:$BG$38,1)))))))),0)))","v":false},null,{"$f":"IF(Y236=\"\",\"\",INDEX($AZ$10:$BG$10,MATCH(Y236,$AZ$8:$BG$8,0)))","v":""},{"$f":"VALUE(RIGHT(AS236,1))","v":{"$error":"#VALUE!"}},null,"SI(AE35=AZ39;AZ35:AZ38;SI(AE35=BA39;BA35:BA38;SI(AE35=Bb39;Bb35:Bb38;SI(AE35=Bc39;Bc35:Bc38;SI(AE35=Bd39;Bd35:Bd38;SI(AE35=Be39;Be35:Be38;SI(AE35=Bf39;Bf35:Bf38;SI(AE35=Bg39;Bg35:Bg38;AY35:AY38))))))))",null,null,"c2",{"$f":"IF(Réglages!$B$15=\"\",\"\",\"C2 \"&Réglages!$B$15)","v":"C2 99 points"},{"$f":"IF(Réglages!$C$15=\"\",\"\",\"C2 \"&Réglages!$C$15)","v":""},{"$f":"IF(Réglages!$D$15=\"\",\"\",\"C2 \"&Réglages!$D$15)","v":""},{"$f":"IF(Réglages!$E$15=\"\",\"\",\"C2 \"&Réglages!$E$15)","v":""},{"$f":"IF(Réglages!$F$15=\"\",\"\",\"C2 \"&Réglages!$F$15)","v":""},{"$f":"IF(Réglages!$G$15=\"\",\"\",\"C2 \"&Réglages!$G$15)","v":""},{"$f":"IF(Réglages!$H$15=\"\",\"\",\"C2 \"&Réglages!$H$15)","v":""},{"$f":"IF(Réglages!$I$15=\"\",\"\",\"C2 \"&Réglages!$I$15)","v":""}]
[null,null,null,null,null,null,null,null,null,null,null,null,null,null,null,null,null,null,{"$f":" Réglages!$H$52&AR223&\" >\"","v":"Mon Projet pour L2 >"},null,null,null,null,null,null,null,null,null,null,null,null,null,null,null,null,null,null,null,{"$f":"Réglages!$H$53&AR223&\" >\"","v":"Mon Axe Pioritaire en L2 >"},null,null,null,null,null,null,null,null,null,null,null,"c3",{"$f":"IF(Réglages!$B$16=\"\",\"\",\"C3 \"&Réglages!$B$16)","v":"C3 999 pts "},{"$f":"IF(Réglages!$C$16=\"\",\"\",\"C3 \"&Réglages!$C$16)","v":""},{"$f":"IF(Réglages!$D$16=\"\",\"\",\"C3 \"&Réglages!$D$16)","v":""},{"$f":"IF(Réglages!$E$16=\"\",\"\",\"C3 \"&Réglages!$E$16)","v":""},{"$f":"IF(Réglages!$F$16=\"\",\"\",\"C3 \"&Réglages!$F$16)","v":""},{"$f":"IF(Réglages!$G$16=\"\",\"\",\"C3 \"&Réglages!$G$16)","v":""},{"$f":"IF(Réglages!$H$16=\"\",\"\",\"C3 \"&Réglages!$H$16)","v":""},{"$f":"IF(Réglages!$I$16=\"\",\"\",\"C3 \"&Réglages!$I$16)","v":""}]
[null,null,null,null,null,null,null,null,null,null,null,null,null,null,null,null,null,null,null,null,null,null,null,null,null,null,null,null,null,null,null,null,null,null,null,null,null,null,null,null,null,null,null,null,null,null,null,null,null,null,"c4",{"$f":"IF(Réglages!$B$17=\"\",\"\",\"C4 \"&Réglages!$B$17)","v":"C4 9999 pts"},{"$f":"IF(Réglages!$C$17=\"\",\"\",\"C4 \"&Réglages!$C$17)","v":""},{"$f":"IF(Réglages!$D$17=\"\",\"\",\"C4 \"&Réglages!$D$17)","v":""},{"$f":"IF(Réglages!$E$17=\"\",\"\",\"C4 \"&Réglages!$E$17)","v":""},{"$f":"IF(Réglages!$F$17=\"\",\"\",\"C4 \"&Réglages!$F$17)","v":""},{"$f":"IF(Réglages!$G$17=\"\",\"\",\"C4 \"&Réglages!$G$17)","v":""},{"$f":"IF(Réglages!$H$17=\"\",\"\",\"C4 \"&Réglages!$H$17)","v":""},{"$f":"IF(Réglages!$I$17=\"\",\"\",\"C4 \"&Réglages!$I$17)","v":""}]
[null,null,null,null,null,null,null,null,null,null,null,null,null,null,null,null,null,null,null,null,null,null,null,null,null,null,null,null,null,null,null,null,null,null,null,null,null,null,null,null,null,null,null,null,null,null,null,null,null,null,{"$f":"Réglages!$L$5","v":"Moteur "},{"$f":"IF($AZ$8=\"\",\"\",$AZ$8)","v":"Le serveur "},{"$f":"IF($BA$8=\"\",\"\",$BA$8)","v":"Observateur"},{"$f":"IF($BB$8=\"\",\"\",$BB$8)","v":"?"},{"$f":"IF($BC$8=\"\",\"\",$BC$8)","v":""},{"$f":"IF($BD$8=\"\",\"\",$BD$8)","v":""},{"$f":"IF($BE$8=\"\",\"\",$BE$8)","v":""},{"$f":"IF($BF$8=\"\",\"\",$BF$8)","v":""},{"$f":"IF($BG$8=\"\",\"\",$BG$8)","v":""}]
[null,null,null,null,null,null,null,null,null,null,null,null,null,null,null,null,null,null,null,null,null,null,null,null,null,null,null,null,null,null,null,null,null,null,null,null,null,null,null,null,null,null,null,null,null,null,null,null,null,null,{"$f":"Réglages!$L$6","v":"Non moteur"},{"$f":"IF($AZ$8=\"\",\"\",$AZ$8)","v":"Le serveur "},{"$f":"IF($BA$8=\"\",\"\",$BA$8)","v":"Observateur"},{"$f":"IF($BB$8=\"\",\"\",$BB$8)","v":"?"},{"$f":"IF($BC$8=\"\",\"\",$BC$8)","v":""},{"$f":"IF($BD$8=\"\",\"\",$BD$8)","v":""},{"$f":"IF($BE$8=\"\",\"\",$BE$8)","v":""},{"$f":"IF($BF$8=\"\",\"\",$BF$8)","v":""},{"$f":"IF($BG$8=\"\",\"\",$BG$8)","v":""}]
[]
[]
[null,null,null,null,null,null,null,null,null,null,null,null,null,null,null,null,null,"Leçon 12",null,null,null,null,null,null,null,null,null,null,null,null,null,null,null,null,null,null,null,null,null,null,null,null,null,{"$f":"RIGHT(R243,1)+1","v":3},{"$f":"MATCH(AG245,IF(AW245=1,AZ232:AZ241,IF(AW245=2,BA232:BA241,1)),0)","v":{"$error":"#VALUE!"}},{"$f":"OR(AND(AW245=1,MATCH(AG245,AZ232:AZ241,0)),(AND(AW245=2,MATCH(AG245,BA232:BA241,0))))","v":{"$error":"#VALUE!"}}]
[null,null,null,null,null,null,null,null,null,null,null,null,null,null,null,null,null,null,{"$f":"Réglages!$D$54","v":"Axes de Travail "},null,null,null,null,null,null,null,null,null,null,null,null,null,{"$f":"Réglages!$F$50","v":"Situations d'apprentissage"},null,null,null,{"$f":"Réglages!$F$51","v":"Résultats "},null,{"$f":"Réglages!$F$52","v":"Je me projette"},null,null,null,null,-1,0,1,"réf",null,"n colonne","n ligne "]
[null,null,null,null,null,null,null,null,null,null,null,null,null,null,null,null,null,null,"",null,null,null,null,null,null,null,null,null,{"$f":"IF(S245=\"\",\"\",INDEX($AZ$10:$BG$10,MATCH(S245,$AZ$8:$BG$8,0)))","v":""},null,null,null,null,null,null,null,null,null,null,null,null,null,{"$f":"IF(AG245=\"\",\"\",ISNUMBER(MATCH(AG245,IF(AW245=1,$AZ$12:$AZ$26,IF(AW245=2,$BA$12:$BA$26,IF(AW245=3,$BB$12:$BB$26,IF(AW245=4,$BC$12:$BC$26,IF(AW245=5,$BD$12:$BD$26,IF(AW$5=6,$BE$12:$BE$26,IF(AW245=7,$BF$12:$BF$26,IF(AW245=8,$BG$12:$BG$26,1)))))))),0)))","v":""},{"$f":"IFERROR(INDEX($AZ$12:$BG$26,AX245-1,AW245),\"\")","v":""},{"$f":"IFERROR(INDEX($AZ$12:$BG$26,AX245,AW245),\"\")","v":""},{"$f":"IFERROR(INDEX($AZ$12:$BG$26,AX245+1,AW245),\"\")","v":""},"Sit de Réf",null,{"$f":"VALUE(RIGHT(AC245,1))","v":{"$error":"#VALUE!"}},{"$f":"VALUE(LEFT(AG245,2))","v":{"$error":"#VALUE!"}},{"$f":"IF(AM245=\"\",\"\",IF(AM245=AU245,AU245,ISNUMBER(MATCH(AM245,IF(AW245=1,$AZ$12:$AZ$26,IF(AW245=2,$BA$12:$BA$26,IF(AW245=3,$BB$12:$BB$26,IF(AW245=4,$BC$12:$BC$26,IF(AW245=5,$BD$12:$BD$26,IF(AW$5=6,$BE$12:$BE$26,IF(AW245=7,$BF$12:$BF$26,IF(AW245=8,$BG$12:$BG$26,1)))))))),0))))","v":""}]
[null,null,null,null,null,null,null,null,null,null,null,null,null,null,null,null,null,null,"",null,null,null,null,null,null,null,null,null,"",null,null,null,null,null,null,null,null,null,null,null,null,null,{"$f":"IF(AG246=\"\",\"\",ISNUMBER(MATCH(AG246,IF(AW246=1,$AZ$12:$AZ$26,IF(AW246=2,$BA$12:$BA$26,IF(AW246=3,$BB$12:$BB$26,IF(AW246=4,$BC$12:$BC$26,IF(AW246=5,$BD$12:$BD$26,IF(AW$5=6,$BE$12:$BE$26,IF(AW246=7,$BF$12:$BF$26,IF(AW246=8,$BG$12:$BG$26,1)))))))),0)))","v":""},{"$f":"IFERROR(INDEX($AZ$12:$BG$26,AX246-1,AW246),\"\")","v":""},{"$f":"IFERROR(INDEX($AZ$12:$BG$26,AX246,AW246),\"\")","v":""},{"$f":"IFERROR(INDEX($AZ$12:$BG$26,AX246+1,AW246),\"\")","v":""},"Sit de Réf",null,{"$error":"#VALUE!"},{"$f":"VALUE(LEFT(AG246,2))","v":{"$error":"#VALUE!"}},{"$f":"IF(AM246=\"\",\"\",IF(AM246=AU246,AU246,ISNUMBER(MATCH(AM246,IF(AW246=1,$AZ$12:$AZ$26,IF(AW246=2,$BA$12:$BA$26,IF(AW246=3,$BB$12:$BB$26,IF(AW246=4,$BC$12:$BC$26,IF(AW246=5,$BD$12:$BD$26,IF(AW$5=6,$BE$12:$BE$26,IF(AW246=7,$BF$12:$BF$26,IF(AW246=8,$BG$12:$BG$26,1)))))))),0))))","v":""}]
[null,null,null,null,null,null,null,null,null,null,null,null,null,null,null,null,null,null,"",null,null,null,null,null,null,null,null,null,"",null,null,null,null,null,null,null,null,null,null,null,null,null,"","","","","Sit de Réf",null,{"$error":"#VALUE!"},{"$error":"#VALUE!"},""]
[null,null,null,null,null,null,null,null,null,null,null,null,null,null,null,null,null,null,"",null,null,null,null,null,null,null,null,null,"",null,null,null,null,null,null,null,null,null,null,null,null,null,"","","","","Sit de Réf",null,{"$error":"#VALUE!"},{"$error":"#VALUE!"},""]
[null,null,null,null,null,null,null,null,null,null,null,null,null,null,null,null,null,null,"",null,null,null,null,null,null,null,null,null,"",null,null,null,null,null,null,null,null,null,null,null,null,null,"","","","","Sit de Réf",null,{"$error":"#VALUE!"},{"$error":"#VALUE!"},""]
[null,null,null,null,null,null,null,null,null,null,null,null,null,null,null,null,null,null,"",null,null,null,null,null,null,null,null,null,"",null,null,null,null,null,null,null,null,null,null,null,null,null,"","","","","Sit de Réf",null,{"$error":"#VALUE!"},{"$error":"#VALUE!"},""]
[null,null,null,null,null,null,null,null,null,null,null,null,null,null,null,null,null,null,"",null,null,null,null,null,null,null,null,null,"",null,null,null,null,null,null,null,null,null,null,null,null,null,"","","","","Sit de Réf",null,{"$error":"#VALUE!"},{"$error":"#VALUE!"},""]
[null,null,null,null,null,null,null,null,null,null,null,null,null,null,null,null,null,null,"",null,null,null,null,null,null,null,null,null,"",null,null,null,null,null,null,null,null,null,null,null,null,null,"","","","","Sit de Réf",null,{"$error":"#VALUE!"},{"$error":"#VALUE!"},""]
[null,null,null,null,null,null,null,null,null,null,null,null,null,null,null,null,null,null,"",null,null,null,null,null,null,null,null,null,"",null,null,null,null,null,null,null,null,null,null,null,null,null,"","","","","Sit de Réf",null,{"$error":"#VALUE!"},{"$error":"#VALUE!"},"",{"$f":"$AZ$9","v":"Moteur "},{"$f":"$BA$9","v":"Non moteur"},{"$f":"$BB$9","v":"Quel enjeu ?"},{"$f":"$BC$9","v":""},{"$f":"$BD$9","v":""},{"$f":"$BE$9","v":""},{"$f":"$BF$9","v":""},{"$f":"$BG$9","v":""}]
[null,null,null,null,null,null,null,null,null,null,null,null,null,null,null,null,null,null,"",null,null,null,null,null,null,null,null,null,"",null,null,null,null,null,null,null,null,null,null,null,null,null,"","",{"$f":"IFERROR(INDEX($AZ$12:$BG$26,AX254,AW254),\"\")","v":""},"","Sit de Réf",null,{"$error":"#VALUE!"},{"$error":"#VALUE!"},"",{"$f":"IF(Réglages!$B$12=\"\",\"\",\"Sit de Réf :  \"&Réglages!$B$12)","v":"Sit de Réf :  Le sablier"},{"$f":"IF(Réglages!$C$12=\"\",\"\",\"Sit de Réf :  \"&Réglages!$C$12)","v":""},{"$f":"IF(Réglages!$D$12=\"\",\"\",\"Sit de Réf :  \"&Réglages!$D$12)","v":""},{"$f":"IF(Réglages!$E$12=\"\",\"\",\"Sit de Réf :  \"&Réglages!$E$12)","v":""},{"$f":"IF(Réglages!$F$12=\"\",\"\",\"Sit de Réf :  \"&Réglages!$F$12)","v":""},{"$f":"IF(Réglages!$G$12=\"\",\"\",\"Sit de Réf :  \"&Réglages!$G$12)","v":""},{"$f":"IF(Réglages!$H$12=\"\",\"\",\"Sit de Réf :  \"&Réglages!$H$12)","v":""},{"$f":"IF(Réglages!$I$12=\"\",\"\",\"Sit de Réf :  \"&Réglages!$I$12)","v":""}]
[null,null,null,null,null,null,null,null,null,null,null,null,null,null,null,null,null,null,{"$f":"Réglages!$F$53","v":"Enjeu de travail principal de cette leçon >"},null,null,null,null,null,"",null,null,null,null,null,null,null,{"$f":"IF(Y255=\"\",\"\",IF(Y255=$AZ$39,$AZ$34,IF(Y255=$BA$39,$BA$34,IF(Y255=$BB$39,$BB$34,IF(Y255=$BC$39,$BC$34,IF(Y255=$BD$39,$BD$34,IF(Y255=$BE$39,$BE$34,IF(Y255=$BF$39,$BF$34,$BG$34))))))))","v":""},null,{"$f":"Réglages!$H$50","v":"Critères rappel >"},null,"C2 fggzev",null,{"$f":"Réglages!$H$51","v":"Je me situe >"},null,null,null,{"$f":"IF(AK255=\"\",\"\",ISNUMBER(MATCH(AK255,IF(AT255=1,$AZ$35:$AZ$38,IF(AT255=2,$BA$35:$BA$38,IF(AT255=3,$BB$35:$BB$38,IF(AT255=4,$BC$35:$BC$38,IF(AT255=5,$BD$35:$BD$38,IF(AW$5=6,$BE$35:$BE$38,IF(AT255=7,$BF$35:$BF$38,IF(AT255=8,$BG$35:$BG$38,1)))))))),0)))","v":false},"droite axe !!!!",{"$f":"IF(Y255=\"\",\"\",INDEX($AZ$10:$BG$10,MATCH(Y255,$AZ$8:$BG$8,0)))","v":""},{"$f":"VALUE(RIGHT(AS255,1))","v":{"$error":"#VALUE!"}},null,null,null,null,"c1",{"$f":"IF(Réglages!$B$14=\"\",\"\",\"C1 \"&Réglages!$B$14)","v":"C1 9 points"},{"$f":"IF(Réglages!$C$14=\"\",\"\",\"C1 \"&Réglages!$C$14)","v":""},{"$f":"IF(Réglages!$D$14=\"\",\"\",\"C1 \"&Réglages!$D$14)","v":""},{"$f":"IF(Réglages!$E$14=\"\",\"\",\"C1 \"&Réglages!$E$14)","v":""},{"$f":"IF(Réglages!$F$14=\"\",\"\",\"C1 \"&Réglages!$F$14)","v":""},{"$f":"IF(Réglages!$G$14=\"\",\"\",\"C1 \"&Réglages!$G$14)","v":""},{"$f":"IF(Réglages!$H$14=\"\",\"\",\"C1 \"&Réglages!$H$14)","v":""},{"$f":"IF(Réglages!$I$14=\"\",\"\",\"C1 \"&Réglages!$I$14)","v":""}]
[null,null,null,null,null,null,null,null,null,null,null,null,null,null,null,null,null,null,{"$f":"Réglages!$F$54","v":"Enjeu de travail secondaire de cette leçon >"},null,null,null,null,null,"",null,null,null,null,null,null,null,{"$f":"IF(Y256=\"\",\"\",IF(Y256=$AZ$40,$AZ$35,IF(Y256=$BA$40,$BA$35,IF(Y256=$BB$40,$BB$35,IF(Y256=$BC$40,$BC$35,IF(Y256=$BD$40,$BD$35,IF(Y256=$BE$40,$BE$35,IF(Y256=$BF$40,$BF$35,$BG$35))))))))","v":""},null,{"$f":"Réglages!$H$50","v":"Critères rappel >"},null,"C1 j",null,{"$f":"Réglages!$H$51","v":"Je me situe >"},null,null,null,{"$f":"IF(AK256=\"\",\"\",ISNUMBER(MATCH(AK256,IF(AT256=1,$AZ$35:$AZ$38,IF(AT256=2,$BA$35:$BA$38,IF(AT256=3,$BB$35:$BB$38,IF(AT256=4,$BC$35:$BC$38,IF(AT256=5,$BD$35:$BD$38,IF(AW$5=6,$BE$35:$BE$38,IF(AT256=7,$BF$35:$BF$38,IF(AT256=8,$BG$35:$BG$38,1)))))))),0)))","v":false},null,{"$f":"IF(Y256=\"\",\"\",INDEX($AZ$10:$BG$10,MATCH(Y256,$AZ$8:$BG$8,0)))","v":""},{"$f":"VALUE(RIGHT(AS256,1))","v":{"$error":"#VALUE!"}},null,"SI(AE35=AZ39;AZ35:AZ38;SI(AE35=BA39;BA35:BA38;SI(AE35=Bb39;Bb35:Bb38;SI(AE35=Bc39;Bc35:Bc38;SI(AE35=Bd39;Bd35:Bd38;SI(AE35=Be39;Be35:Be38;SI(AE35=Bf39;Bf35:Bf38;SI(AE35=Bg39;Bg35:Bg38;AY35:AY38))))))))",null,null,"c2",{"$f":"IF(Réglages!$B$15=\"\",\"\",\"C2 \"&Réglages!$B$15)","v":"C2 99 points"},{"$f":"IF(Réglages!$C$15=\"\",\"\",\"C2 \"&Réglages!$C$15)","v":""},{"$f":"IF(Réglages!$D$15=\"\",\"\",\"C2 \"&Réglages!$D$15)","v":""},{"$f":"IF(Réglages!$E$15=\"\",\"\",\"C2 \"&Réglages!$E$15)","v":""},{"$f":"IF(Réglages!$F$15=\"\",\"\",\"C2 \"&Réglages!$F$15)","v":""},{"$f":"IF(Réglages!$G$15=\"\",\"\",\"C2 \"&Réglages!$G$15)","v":""},{"$f":"IF(Réglages!$H$15=\"\",\"\",\"C2 \"&Réglages!$H$15)","v":""},{"$f":"IF(Réglages!$I$15=\"\",\"\",\"C2 \"&Réglages!$I$15)","v":""}]
[null,null,null,null,null,null,null,null,null,null,null,null,null,null,null,null,null,null,{"$f":" Réglages!$H$52&AR243&\" >\"","v":"Mon Projet pour L3 >"},null,null,null,null,null,null,null,null,null,null,null,null,null,null,null,null,null,null,null,{"$f":"Réglages!$H$53&AR243&\" >\"","v":"Mon Axe Pioritaire en L3 >"},null,null,null,null,null,null,null,null,null,null,null,"c3",{"$f":"IF(Réglages!$B$16=\"\",\"\",\"C3 \"&Réglages!$B$16)","v":"C3 999 pts "},{"$f":"IF(Réglages!$C$16=\"\",\"\",\"C3 \"&Réglages!$C$16)","v":""},{"$f":"IF(Réglages!$D$16=\"\",\"\",\"C3 \"&Réglages!$D$16)","v":""},{"$f":"IF(Réglages!$E$16=\"\",\"\",\"C3 \"&Réglages!$E$16)","v":""},{"$f":"IF(Réglages!$F$16=\"\",\"\",\"C3 \"&Réglages!$F$16)","v":""},{"$f":"IF(Réglages!$G$16=\"\",\"\",\"C3 \"&Réglages!$G$16)","v":""},{"$f":"IF(Réglages!$H$16=\"\",\"\",\"C3 \"&Réglages!$H$16)","v":""},{"$f":"IF(Réglages!$I$16=\"\",\"\",\"C3 \"&Réglages!$I$16)","v":""}]
[null,null,null,null,null,null,null,null,null,null,null,null,null,null,null,null,null,null,null,null,null,null,null,null,null,null,null,null,null,null,null,null,null,null,null,null,null,null,null,null,null,null,null,null,null,null,null,null,null,null,"c4",{"$f":"IF(Réglages!$B$17=\"\",\"\",\"C4 \"&Réglages!$B$17)","v":"C4 9999 pts"},{"$f":"IF(Réglages!$C$17=\"\",\"\",\"C4 \"&Réglages!$C$17)","v":""},{"$f":"IF(Réglages!$D$17=\"\",\"\",\"C4 \"&Réglages!$D$17)","v":""},{"$f":"IF(Réglages!$E$17=\"\",\"\",\"C4 \"&Réglages!$E$17)","v":""},{"$f":"IF(Réglages!$F$17=\"\",\"\",\"C4 \"&Réglages!$F$17)","v":""},{"$f":"IF(Réglages!$G$17=\"\",\"\",\"C4 \"&Réglages!$G$17)","v":""},{"$f":"IF(Réglages!$H$17=\"\",\"\",\"C4 \"&Réglages!$H$17)","v":""},{"$f":"IF(Réglages!$I$17=\"\",\"\",\"C4 \"&Réglages!$I$17)","v":""}]
[null,null,null,null,null,null,null,null,null,null,null,null,null,null,null,null,null,null,null,null,null,null,null,null,null,null,null,null,null,null,null,null,null,null,null,null,null,null,null,null,null,null,null,null,null,null,null,null,null,null,{"$f":"Réglages!$L$5","v":"Moteur "},{"$f":"IF($AZ$8=\"\",\"\",$AZ$8)","v":"Le serveur "},{"$f":"IF($BA$8=\"\",\"\",$BA$8)","v":"Observateur"},{"$f":"IF($BB$8=\"\",\"\",$BB$8)","v":"?"},{"$f":"IF($BC$8=\"\",\"\",$BC$8)","v":""},{"$f":"IF($BD$8=\"\",\"\",$BD$8)","v":""},{"$f":"IF($BE$8=\"\",\"\",$BE$8)","v":""},{"$f":"IF($BF$8=\"\",\"\",$BF$8)","v":""},{"$f":"IF($BG$8=\"\",\"\",$BG$8)","v":""}]
[null,null,null,null,null,null,null,null,null,null,null,null,null,null,null,null,null,null,null,null,null,null,null,null,null,null,null,null,null,null,null,null,null,null,null,null,null,null,null,null,null,null,null,null,null,null,null,null,null,null,{"$f":"Réglages!$L$6","v":"Non moteur"},{"$f":"IF($AZ$8=\"\",\"\",$AZ$8)","v":"Le serveur "},{"$f":"IF($BA$8=\"\",\"\",$BA$8)","v":"Observateur"},{"$f":"IF($BB$8=\"\",\"\",$BB$8)","v":"?"},{"$f":"IF($BC$8=\"\",\"\",$BC$8)","v":""},{"$f":"IF($BD$8=\"\",\"\",$BD$8)","v":""},{"$f":"IF($BE$8=\"\",\"\",$BE$8)","v":""},{"$f":"IF($BF$8=\"\",\"\",$BF$8)","v":""},{"$f":"IF($BG$8=\"\",\"\",$BG$8)","v":""}]